program: Gaussian 09
title: 000258220
version: EM64L-G09RevD.01
frameworkgroup: C1[X(C14H13NO2)]
method: RPBEPBE
basis: SDD
operation: Freq
keyword: #p
keyword: freq=noraman
keyword: PBEPBE/SDD
title: #p freq=noraman PBEPBE/SDD
converged: YES YES NO NO
title: Mulliken charges:
elementType: O O N C C C C C C C C C C C C C C H H H H H H H H H H H H H
charge: -0.446277 -0.247568 -0.252484 0.354713 0.092643 0.240039 0.168347 -0.288260 -0.650169 -0.378985 -0.324642 -0.371134 -0.251863 -0.212026 -0.239819 -0.225613 -0.228401 0.268699 0.262620 0.236620 0.253533 0.215982 0.256348 0.261557 0.229878 0.228361 0.229116 0.229624 0.230181 0.358979
chargesum: 0.00000
title: Mulliken charges with hydrogens summed into heavy atoms:
elementType: O O N C C C C C C C C C C C C C C
charge: -0.087298 -0.247568 -0.252484 0.354713 0.092643 0.240039 0.168347 -0.019561 0.102604 -0.163003 -0.068294 -0.109576 -0.021985 0.016336 -0.010703 0.004010 0.001780
polarizability: 2.40011341e+02 -5.38008790e+00 1.65617894e+02 -6.06863202e+00 -7.92644517e+00 8.31497039e+01
1716.lowfreq: -13.8952 -4.2167 -0.0010 -0.0008 -0.0007 4.0881 33.7579 39.9936 59.0288
frequency: 33.7457 39.9757 59.0265 77.0222 122.1197 145.9721 184.9848 193.1497 224.2361 253.2963 291.1713 336.4948 338.7826 354.7378 390.6070 405.9938 451.2584 467.1543 494.8101 543.9359 556.4024 597.4484 614.0140 628.7265 680.5267 702.3888 707.2752 732.7753 746.6886 767.2045 791.7100 830.3523 841.3733 859.1218 926.7319 937.0115 968.4763 982.6508 989.6936 999.6420 1012.2164 1033.3955 1045.5706 1068.0479 1082.2147 1105.3274 1125.8579 1154.6967 1171.0414 1172.7060 1186.6389 1191.1081 1233.7599 1260.1888 1295.5864 1316.1043 1354.9724 1379.8862 1390.2376 1429.8054 1432.6494 1441.8761 1467.6644 1478.6659 1497.5255 1503.0637 1554.3428 1589.4152 1604.1354 1608.8715 1613.0802 2988.0487 3072.1321 3110.9670 3125.2811 3127.0431 3134.7050 3142.5458 3146.0653 3156.0364 3163.1352 3167.8107 3186.7250 3583.9324
redmass: 5.6436 4.2770 5.1538 5.0471 3.3817 1.8257 3.5025 5.1469 2.0807 5.2323 3.8098 2.6601 3.2527 1.4880 5.5222 2.8470 4.5024 3.3634 4.0436 6.5483 4.4700 5.1986 6.3879 5.7728 4.9493 5.6168 1.6182 3.8604 1.3601 4.1755 2.3487 2.0474 2.6250 1.2495 1.3781 1.4374 1.3163 1.4016 5.7420 1.3311 3.8801 2.3128 1.9391 2.2676 1.6048 2.0643 1.3205 1.2408 1.0606 1.0555 1.2804 2.2950 2.6491 3.4569 1.5089 1.3281 3.9259 8.6102 7.2967 1.6511 2.1005 1.6045 1.0619 2.1995 1.7393 1.4047 9.9616 6.2959 6.7754 6.0589 6.7063 1.0364 1.1000 1.0889 1.0865 1.0975 1.0881 1.0888 1.0927 1.0964 1.0961 1.1012 1.0969 1.0660
irintensity: 1.7546 0.1494 2.1144 1.0521 3.4837 0.7924 2.9400 2.7149 1.2906 3.1823 3.0037 29.3620 16.9689 86.5224 2.0122 0.4598 8.1355 4.0654 12.7530 1.8282 8.3674 6.2958 0.2546 17.7259 4.8680 1.3331 78.5586 0.9639 100.1279 14.2615 27.9909 14.0173 10.1234 1.4286 0.8893 4.9194 0.3952 2.5218 0.2109 0.4767 65.2208 5.0975 56.2492 100.9487 6.7998 54.6161 5.2153 54.4982 1.2812 0.1283 39.1562 54.6584 4.6208 45.5205 21.1156 1.9562 304.7362 0.5265 11.0911 13.3358 28.2737 15.0085 25.1036 3.3902 15.8337 97.3641 186.8452 11.4039 6.7373 4.2344 3.9648 47.3934 19.3728 13.4426 3.0102 9.6071 4.0084 8.7745 18.6841 23.9131 28.3503 21.8245 3.1431 29.5623
temp: 298.150 k
press: 1.00000 atm
elementType: 8 8 7 6 6 6 6 6 6 6 6 6 6 6 6 6 6 1 1 1 1 1 1 1 1 1 1 1 1 1
symmnumber: 1
zpe: 617116.2 jmol-1
zpe.correction: 0.235047 hartree
zpe.thermalcorrener: 0.250027 hartree
zpe.thermalcorrenthalpy: 0.250972 hartree
zpe.thermalcorrgfe: 0.192110 hartree
zpe.sumelectzpe: -745.280623 hartree
zpe.sumelectthermal: -745.265643 hartree
zpe.sumelectthermalent: -745.264698 hartree
zpe.sumelectthermalfe: -745.323560 hartree
dipole: 1.0591 3.5519 1.8611
dipole: 4.1475
quadrupole: -76.0217 -89.6442 -103.5933
quadrupole: 4.2979 -3.8643 -7.4818
quadrupole: 13.7313 0.1089 -13.8402 4.2979 -3.8643 -7.4818
hfenergy: -745.5156699 hartree
pointgroup: C01 [X(C14H13N1O2)]
dipole: 0.4304094 1.5578845 0.2243928 debye
polarizability: 239.7157945|-8.2051008|151.8848464|-6.8380125|-31.6334758|97.1782972 unknown
InChI: InChI=1S/C14H13NO2/c1-15(12-9-5-6-10-13(12)16)14(17)11-7-3-2-4-8-11/h2-10,16H,1H3
charge 0 multiplicity 1
30 atoms
O  1.905694 1.983765 -1.126858
O  -0.282208 -1.88928 -0.184248
N  0.365211 0.273603 0.447846
C  1.764362 -0.010094 0.239444
C  -0.597615 -0.694968 0.115304
C  -2.045999 -0.266965 0.080455
C  2.553696 0.874052 -0.546351
C  2.38001 -1.153245 0.799295
C  0.057535 1.536238 1.164664
C  3.933498 0.629902 -0.737382
C  -2.466473 0.927546 -0.55981
C  -3.021118 -1.167755 0.580351
C  3.753178 -1.41143 0.5967
C  4.532292 -0.514585 -0.168542
C  -3.842068 1.22418 -0.679894
C  -4.394359 -0.860781 0.478231
C  -4.808686 0.337354 -0.151393
H  1.764045 -1.844813 1.378833
H  0.24244 2.413673 0.522326
H  0.705448 1.607805 2.057829
H  -0.99093 1.533806 1.494855
H  4.532906 1.326159 -1.339344
H  -1.720344 1.607033 -0.986929
H  -2.686728 -2.10964 1.027701
H  4.208955 -2.305612 1.033422
H  5.599456 -0.702645 -0.327344
H  -4.158439 2.14097 -1.189657
H  -5.140442 -1.556954 0.877027
H  -5.875592 0.571475 -0.23949
H  2.533777 2.483205 -1.705343
