program: Gaussian 09
title: 000258215
version: EM64L-G09RevD.01
frameworkgroup: C1[X(C13H10BrNO2)]
method: RPBEPBE
basis: SDD
operation: Freq
keyword: #p
keyword: freq=noraman
keyword: PBEPBE/SDD
title: #p freq=noraman PBEPBE/SDD
converged: YES YES NO NO
title: Mulliken charges:
elementType: Br O O N C C C C C C C C C C C C C H H H H H H H H H H
charge: 0.005356 -0.489232 -0.267243 -0.472572 0.348029 0.268961 0.129767 0.111658 -0.317280 -0.290637 -0.347454 -0.346345 -0.236324 -0.222384 -0.211214 -0.210989 -0.200769 0.364381 0.311725 0.243209 0.280111 0.220236 0.229749 0.229256 0.240212 0.255798 0.373994
chargesum: 0.00000
title: Mulliken charges with hydrogens summed into heavy atoms:
elementType: Br O O N C C C C C C C C C C C C C
charge: 0.005356 -0.115237 -0.267243 -0.108191 0.348029 0.268961 0.129767 0.111658 -0.005555 -0.047428 -0.067343 -0.126109 -0.006575 0.006872 -0.211214 0.029224 0.055030
polarizability: 2.76845265e+02 -6.84140764e+00 1.97871991e+02 -9.47812076e+00 -1.62797593e+00 6.79172457e+01
1716.lowfreq: -7.8936 -3.2756 0.0003 0.0005 0.0006 2.3609 18.7453 41.0271 51.1251
frequency: 18.7420 41.0107 51.1054 89.7871 134.6533 144.6544 177.4399 205.9111 231.5893 267.0922 284.6846 298.5005 314.1932 325.1152 416.3144 446.3193 448.2018 453.9747 498.8265 539.0826 558.3965 586.3163 641.8099 673.6518 702.0325 712.1538 723.6881 743.0982 752.7713 780.5743 809.3740 837.6284 848.6141 877.7218 889.3344 935.0111 936.1876 981.2823 986.6494 998.8238 1033.3442 1058.3922 1070.9233 1089.4816 1112.1536 1141.0295 1170.0753 1177.4022 1209.1821 1246.6935 1267.4258 1296.9431 1315.7425 1374.3228 1401.3275 1404.9986 1439.5485 1457.0814 1493.5930 1521.6807 1557.9641 1596.5558 1600.7186 1606.8223 1623.8530 3120.2671 3143.9365 3144.9194 3146.2552 3166.5795 3167.7186 3178.5611 3197.8863 3511.1144 3618.1225
redmass: 5.8767 6.3673 7.8201 6.3470 6.6776 6.1658 4.7949 5.1413 6.7559 5.3824 11.7027 1.9641 1.7397 6.5512 3.4211 4.0682 3.8828 4.3217 5.8108 7.6823 3.7556 6.6763 6.9757 3.4690 6.2802 1.5808 3.0540 2.0831 1.3171 6.0649 1.5374 5.1070 1.3791 5.1405 1.7295 1.3849 1.3520 5.9021 1.3020 1.3548 2.1081 3.3375 2.1511 1.7358 2.1811 1.2412 1.0730 1.0875 1.9574 3.2190 1.8240 1.2889 1.8736 9.0135 4.7441 3.4343 2.5585 2.3004 2.6464 2.3130 6.4351 6.0700 6.0044 6.7162 5.9057 1.0889 1.0891 1.0923 1.0876 1.0980 1.0927 1.0989 1.0952 1.0758 1.0666
irintensity: 1.7210 2.1631 1.2967 1.9644 1.7770 1.7227 2.6520 0.4080 0.7883 5.8830 5.1076 78.8782 73.9577 12.5743 1.0250 12.6601 11.6672 2.4227 5.9913 4.3425 0.3264 12.4280 7.7598 9.9234 37.7435 10.5641 17.0279 12.3698 197.3505 35.2065 23.3700 5.8968 2.3453 10.5889 16.1643 0.2589 7.9965 9.1508 3.3696 2.1712 13.2622 17.4973 110.5483 19.2736 39.6227 40.3884 1.1601 3.6377 13.6585 97.7435 64.1811 2.8932 77.0200 0.4387 22.0206 30.2800 132.2794 28.2428 48.8943 524.5018 113.4330 33.7495 32.9981 9.3865 34.8102 11.3739 10.3915 5.1761 6.5937 23.9799 0.4136 10.1945 7.0426 36.6359 46.1358
temp: 298.150 k
press: 1.00000 atm
elementType: 35 8 8 7 6 6 6 6 6 6 6 6 6 6 6 6 6 1 1 1 1 1 1 1 1 1 1
symmnumber: 1
zpe: 520524.7 jmol-1
zpe.correction: 0.198257 hartree
zpe.thermalcorrener: 0.213111 hartree
zpe.thermalcorrenthalpy: 0.214056 hartree
zpe.thermalcorrgfe: 0.153776 hartree
zpe.sumelectzpe: -718.872049 hartree
zpe.sumelectthermal: -718.857195 hartree
zpe.sumelectthermalent: -718.856250 hartree
zpe.sumelectthermalfe: -718.916530 hartree
dipole: 0.8089 -2.8280 1.1734
dipole: 3.1668
quadrupole: -93.3108 -97.0005 -113.1464
quadrupole: -18.7619 -0.5612 -0.2204
quadrupole: 7.8418 4.1521 -11.9938 -18.7619 -0.5612 -0.2204
hfenergy: -719.070306 hartree
pointgroup: C01 [X(C13H10Br1N1O2)]
dipole: -0.6405471 -0.6501022 0.8481294 debye
polarizability: 269.5729677|-36.9971919|86.7678482|2.0847533|-38.974987|186.2936866 unknown
InChI: InChI=1S/C13H10BrNO2/c14-10-5-3-4-9(8-10)13(17)15-11-6-1-2-7-12(11)16/h1-8,15-16H
charge 0 multiplicity 1
27 atoms
Br 4.069404 -1.282907 2.782249
O  -2.059558 -1.05296 2.027191
O  0.056037 0.792503 -2.036349
N  -0.659376 -0.158918 -0.015307
C  -2.042709 0.147242 -0.042116
C  1.721078 -0.237599 -0.604393
C  0.310906 0.182894 -0.950358
C  -2.804441 -0.333348 1.063239
C  -2.702719 0.879334 -1.059901
C  2.145443 -0.527543 0.720406
C  2.656327 -0.304364 -1.66761
C  -4.186176 -0.093715 1.160649
C  -4.092002 1.121436 -0.960843
C  -4.835434 0.640586 0.139496
C  3.485694 -0.895965 0.94464
C  3.991958 -0.678381 -1.418932
C  4.422379 -0.982869 -0.105419
H  -0.384277 -0.728361 0.790351
H  -2.118796 1.241369 -1.907637
H  1.468174 -0.433173 1.575576
H  2.310486 -0.049823 -2.674056
H  -4.753428 -0.47208 2.02058
H  -4.592135 1.688486 -1.752649
H  -5.911305 0.83071 0.20919
H  4.709691 -0.734772 -2.243848
H  5.458434 -1.270845 0.093822
H  -2.629253 -1.370239 2.767826
