program: Gaussian 09
title: 000258219
version: EM64L-G09RevD.01
frameworkgroup: C1[X(C14H12BrNO2)]
method: RPBEPBE
basis: SDD
operation: Freq
keyword: #p
keyword: freq=noraman
keyword: PBEPBE/SDD
title: #p freq=noraman PBEPBE/SDD
converged: YES YES NO NO
title: Mulliken charges:
elementType: Br O O N C C C C C C C C C C C C C C H H H H H H H H H H H H
charge: 0.002785 -0.327956 -0.267518 -0.471170 0.328532 0.170156 0.267951 0.127062 -0.323084 -0.322452 -0.291873 -0.347567 -0.234265 -0.247018 -0.210351 -0.211392 -0.201439 -0.526170 0.360225 0.310976 0.239726 0.242678 0.280223 0.228780 0.226511 0.239970 0.255528 0.228269 0.245014 0.227870
chargesum: 0.00000
title: Mulliken charges with hydrogens summed into heavy atoms:
elementType: Br O O N C C C C C C C C C C C C C C
charge: 0.002785 -0.327956 -0.267518 -0.110945 0.328532 0.170156 0.267951 0.127062 -0.012108 -0.082726 -0.049195 -0.067345 -0.005485 -0.020506 -0.210351 0.028578 0.054089 0.174982
polarizability: 2.85663656e+02 7.31942853e-01 2.15979694e+02 1.20140925e+01 2.48845010e+00 7.79929670e+01
1716.lowfreq: -7.1717 -2.2017 -0.0007 -0.0007 0.0004 3.7009 14.9791 39.8050 46.3289
frequency: 14.7428 39.7958 46.3212 79.3019 99.4907 125.7291 137.7654 175.6710 193.3811 206.1235 235.3880 253.2807 284.3066 294.2951 312.4435 324.6285 415.6481 445.0934 458.0622 483.4877 502.5030 546.9989 559.6599 585.2829 642.4669 673.5614 702.9304 716.9078 725.7485 746.8014 754.2146 757.3166 808.3016 831.4502 855.8159 876.6175 888.7944 934.4196 939.6855 981.3677 986.4912 995.4943 998.2322 1039.7385 1062.1006 1083.8026 1098.5991 1116.9789 1120.1754 1151.9010 1174.0956 1176.8635 1199.5898 1244.5716 1258.5304 1293.8722 1307.3733 1374.2166 1393.7242 1404.2628 1427.1144 1449.6064 1454.7165 1466.1594 1470.6608 1486.4139 1519.1868 1557.4588 1595.1466 1600.0778 1605.7861 1612.5245 2968.4007 3059.4827 3128.3950 3137.0212 3146.0291 3146.9625 3154.7899 3167.4753 3170.1715 3178.2381 3195.9010 3503.2400
redmass: 5.3235 6.6851 6.1647 4.5576 4.0836 6.9017 4.9980 4.0497 2.3755 4.5826 1.8639 3.9143 12.0002 3.9274 4.2408 6.3061 3.5174 4.8771 3.4885 5.7135 5.4530 5.3354 3.8271 6.5770 6.9605 3.4590 6.2574 1.7275 2.6405 2.1011 3.5919 1.4831 1.5443 4.8971 1.3817 4.7309 1.7789 1.3912 1.3482 5.9051 1.3033 8.3313 1.3609 2.1349 3.1681 2.0222 1.8538 1.2597 1.9595 1.4052 1.0753 1.0867 2.3242 3.1821 1.8065 1.3135 1.7954 8.8800 6.2576 2.8634 1.5568 1.6998 2.2093 1.0543 1.3332 1.7380 2.3506 6.6357 6.7439 6.4300 5.9692 5.7353 1.0323 1.1045 1.1003 1.0859 1.0877 1.0919 1.0915 1.0927 1.0977 1.0989 1.0954 1.0757
irintensity: 1.2192 1.4358 1.6222 0.1645 8.4877 2.0956 1.0971 3.4716 0.2942 1.0482 0.9776 0.5332 3.7164 4.7064 1.3150 9.9587 1.4806 5.4490 8.4441 5.5613 5.0381 14.5097 0.9229 8.8091 9.7641 8.4318 27.9399 5.1229 29.2816 7.1048 47.4652 168.8788 25.5761 1.5459 1.4238 14.3449 16.6300 0.7650 8.1226 9.2825 3.4605 53.6411 1.9938 23.0925 14.3220 20.4638 25.9987 0.4462 33.2583 0.1110 4.2737 3.7191 57.7546 96.6870 91.0684 4.6858 54.8443 0.6307 49.3356 14.6954 78.3883 75.3243 14.0043 15.1846 97.7655 36.2233 507.3757 114.6605 58.9586 21.9312 11.3305 26.8624 64.1871 40.8742 16.6782 0.9390 9.1537 2.7734 21.2949 0.3701 21.1924 10.3790 7.1528 43.2069
temp: 298.150 k
press: 1.00000 atm
elementType: 35 8 8 7 6 6 6 6 6 6 6 6 6 6 6 6 6 6 1 1 1 1 1 1 1 1 1 1 1 1
symmnumber: 1
zpe: 594169.4 jmol-1
zpe.correction: 0.226307 hartree
zpe.thermalcorrener: 0.242602 hartree
zpe.thermalcorrenthalpy: 0.243547 hartree
zpe.thermalcorrgfe: 0.179700 hartree
zpe.sumelectzpe: -758.083083 hartree
zpe.sumelectthermal: -758.066787 hartree
zpe.sumelectthermalent: -758.065843 hartree
zpe.sumelectthermalfe: -758.129690 hartree
dipole: -0.7511 -3.4125 1.1474
dipole: 3.6778
quadrupole: -99.7791 -104.5213 -119.1033
quadrupole: 18.3464 1.7217 0.4707
quadrupole: 8.0221 3.2799 -11.3021 18.3464 1.7217 0.4707
hfenergy: -758.3093898 hartree
pointgroup: C01 [X(C14H12Br1N1O2)]
dipole: -0.5407885 1.3142431 -0.2719847 debye
polarizability: 283.5538814|13.6688867|215.3582266|-9.8189039|19.6357117|80.7242084 unknown
InChI: InChI=1S/C14H12BrNO2/c1-18-13-8-3-2-7-12(13)16-14(17)10-5-4-6-11(15)9-10/h2-9,16H,1H3
charge 0 multiplicity 1
30 atoms
Br 4.344247 2.636822 0.816779
O  -1.716259 1.992998 0.002749
O  0.278216 -2.506359 0.004579
N  -0.390121 -0.257587 0.013952
C  -1.797435 -0.384113 0.12266
C  -2.529655 0.845129 0.118964
C  2.000425 -0.799241 -0.066963
C  0.563768 -1.267438 -0.007808
C  -2.501735 -1.606262 0.234062
C  -3.932706 0.853047 0.226613
C  2.414381 0.500331 0.33198
C  2.969072 -1.733552 -0.51235
C  -3.911874 -1.5942 0.34331
C  -4.62556 -0.377395 0.33969
C  3.778326 0.839527 0.252406
C  4.32882 -1.370561 -0.584973
C  4.749906 -0.073522 -0.205767
C  -2.374529 3.300298 -0.014257
H  -0.08147 0.713942 -0.088759
H  -1.936367 -2.539639 0.230534
H  -4.489434 1.794799 0.224677
H  1.705839 1.229726 0.737574
H  2.628116 -2.736463 -0.786654
H  -4.448931 -2.544375 0.429833
H  -5.717458 -0.375348 0.423363
H  5.072725 -2.093554 -0.935357
H  5.804233 0.212456 -0.257204
H  -3.06446 3.384786 -0.875273
H  -1.56188 4.034536 -0.114346
H  -2.926798 3.47811 0.928086
