program: Gaussian 09
title: 000258217
version: EM64L-G09RevD.01
frameworkgroup: C1[X(C13H19NO2)]
method: RPBEPBE
basis: SDD
operation: Freq
keyword: #p
keyword: freq=noraman
keyword: PBEPBE/SDD
title: #p freq=noraman PBEPBE/SDD
converged: YES YES NO NO
title: Mulliken charges:
elementType: O O N C C C C C C C C C C C C C H H H H H H H H H H H H H H H H H H H
charge: -0.260228 -0.323521 -0.450329 -0.360656 -0.336536 -0.553594 -0.356295 0.198050 -0.694278 0.316323 0.169933 -0.324713 -0.324327 -0.236529 -0.249712 -0.527855 0.237786 0.197147 0.182894 0.186182 0.231072 0.211694 0.200309 0.195232 0.207947 0.216839 0.210357 0.340963 0.311036 0.238211 0.227069 0.224586 0.226757 0.226662 0.241524
chargesum: 0.00000
title: Mulliken charges with hydrogens summed into heavy atoms:
elementType: O O N C C C C C C C C C C C C C
charge: -0.260228 -0.323521 -0.109366 0.074277 0.032540 -0.110828 0.039246 0.198050 -0.059136 0.316323 0.169933 -0.013677 -0.086116 -0.009460 -0.025125 0.167088
polarizability: 2.25912210e+02 1.62434386e+00 1.64034918e+02 1.19738868e+01 2.99378095e+00 9.45653384e+01
1716.lowfreq: -9.3427 -5.8244 -0.0009 -0.0007 -0.0006 4.8334 15.9952 37.0051 45.9122
frequency: 15.7942 36.9500 45.8073 75.3606 89.9932 98.1541 104.4302 122.7371 137.9428 178.0243 189.9192 233.3997 233.9527 242.5904 264.8063 304.7256 317.3816 384.7401 417.1293 458.0265 480.5627 521.1102 557.4071 571.6315 627.6677 717.0170 723.2943 727.4468 744.4140 752.4436 755.1089 765.6451 822.7005 849.4903 854.5212 890.4028 937.6391 941.4058 957.9765 985.9580 995.5643 1007.5920 1038.7349 1057.8253 1078.0952 1091.6839 1107.7268 1112.5791 1117.0376 1151.1200 1171.8568 1183.3426 1198.1941 1207.4273 1242.3973 1253.4504 1263.0137 1285.7968 1290.9532 1297.8787 1317.1637 1346.4553 1354.4914 1388.4327 1393.5532 1426.2509 1447.2106 1449.4138 1465.1207 1465.8176 1466.1951 1470.8280 1477.6454 1481.0818 1482.1702 1488.5370 1514.3339 1603.8175 1605.1673 1618.9648 2951.3757 2965.1191 2969.5356 2971.1530 2972.1748 2982.6172 2994.3304 3021.6422 3027.1890 3055.0589 3058.9650 3069.1823 3071.5138 3125.0033 3135.1448 3152.5205 3168.3792 3195.0523 3507.8725
redmass: 4.3903 4.4298 1.7207 4.2714 3.0072 3.6375 2.5778 2.1496 3.1411 3.0992 2.4807 1.2218 1.5423 3.6434 3.3582 4.8884 3.8093 3.3690 3.3455 3.2931 5.6763 4.0135 3.9711 4.8770 4.6105 5.1117 1.4668 1.1163 2.1104 1.2520 1.4215 3.2856 2.4128 1.7633 1.3870 2.0359 1.3462 4.3718 1.2605 1.3004 8.5961 4.0396 2.0641 3.0775 2.2776 1.5177 1.8977 2.3192 1.2584 1.4066 1.0731 2.1474 2.2680 1.6116 1.3440 1.7880 1.3122 1.0959 1.1463 1.6392 1.4641 1.5129 1.6449 1.2176 5.8370 1.6140 1.1447 1.6018 1.0562 1.0935 1.4495 1.0718 1.0429 1.0705 1.3762 1.0904 2.5885 6.0113 7.3269 4.8645 1.0589 1.0325 1.0578 1.0543 1.0426 1.0660 1.0944 1.0988 1.1028 1.1044 1.1030 1.1009 1.0993 1.1000 1.0857 1.0914 1.0979 1.0953 1.0762
irintensity: 0.6354 0.7215 0.0100 0.0584 1.4583 9.2305 2.0438 1.1406 3.2288 2.3761 0.1779 0.7934 2.5412 5.1480 2.4284 1.7029 0.6348 0.1686 7.6269 7.7359 1.0602 16.1735 1.6533 3.8875 0.3806 4.9879 15.4073 11.2087 10.2229 72.1825 76.8021 13.4395 1.9766 3.1426 1.6320 2.4779 7.4068 17.8192 2.2757 3.6910 53.7547 0.1921 20.7739 2.0770 2.3930 12.8583 51.1348 11.7515 0.3122 0.3768 4.2130 38.0077 62.7937 16.9607 21.1355 64.1653 12.8012 8.6097 5.8461 16.8041 28.1137 6.7594 2.4631 9.7231 69.3402 96.3426 13.1310 76.8978 15.9478 9.5034 97.7854 0.7850 12.3769 6.2052 21.5285 23.1103 457.7675 8.4968 132.6078 41.5786 15.2049 67.1506 49.4866 9.8860 27.6145 54.5055 11.3643 23.8246 1.7263 42.5171 29.8279 112.1115 54.8783 20.8561 1.0854 22.3144 19.9196 7.2147 47.7712
temp: 298.150 k
press: 1.00000 atm
elementType: 8 8 7 6 6 6 6 6 6 6 6 6 6 6 6 6 1 1 1 1 1 1 1 1 1 1 1 1 1 1 1 1 1 1 1
symmnumber: 1
zpe: 777240.5 jmol-1
zpe.correction: 0.296035 hartree
zpe.thermalcorrener: 0.313298 hartree
zpe.thermalcorrenthalpy: 0.314242 hartree
zpe.thermalcorrgfe: 0.248781 hartree
zpe.sumelectzpe: -710.765075 hartree
zpe.sumelectthermal: -710.747813 hartree
zpe.sumelectthermalent: -710.746869 hartree
zpe.sumelectthermalfe: -710.812329 hartree
dipole: -1.6346 4.7382 -0.1945
dipole: 5.0160
quadrupole: -81.4074 -92.1383 -99.8317
quadrupole: -5.6840 1.9457 1.1239
quadrupole: 9.7184 -1.0125 -8.7060 -5.6840 1.9457 1.1239
hfenergy: -711.0611105 hartree
pointgroup: C01 [X(C13H19N1O2)]
dipole: 0.5890542 1.8046861 0.5390858 debye
polarizability: 224.9641002|-3.7666407|161.3878797|16.1320795|13.3621911|98.1604871 unknown
InChI: InChI=1S/C13H19NO2/c1-3-4-5-10-13(15)14-11-8-6-7-9-12(11)16-2/h6-9,14H,3-5,10H2,1-2H3
charge 0 multiplicity 1
35 atoms
O  -0.797568 -1.765479 -0.881966
O  2.087397 1.995534 0.499507
N  0.325348 0.193444 -0.241468
C  -3.28141 -0.355511 -0.024958
C  -4.616504 0.375502 -0.284546
C  -2.084208 0.317535 -0.739128
C  -5.812715 -0.280662 0.442711
C  -0.805806 -0.522044 -0.628792
C  -7.150164 0.443161 0.175577
C  1.652073 -0.278259 -0.070699
C  2.617954 0.69653 0.333295
C  2.066812 -1.616618 -0.268466
C  3.965344 0.342001 0.534503
C  3.421745 -1.969188 -0.066192
C  4.367066 -1.001362 0.332328
C  3.0047 3.058224 0.911043
H  -3.345372 -1.403272 -0.373837
H  -3.084511 -0.396407 1.065415
H  -4.53367 1.436031 0.034791
H  -4.818912 0.393793 -1.376265
H  -2.324412 0.413711 -1.817522
H  -1.930404 1.34332 -0.349773
H  -5.892835 -1.340026 0.125323
H  -5.610872 -0.297813 1.533192
H  -7.104406 1.497183 0.509503
H  -7.98764 -0.043874 0.708153
H  -7.391489 0.444125 -0.904227
H  0.215866 1.194101 -0.0507
H  1.322647 -2.353532 -0.575484
H  4.701097 1.089995 0.844654
H  3.732267 -3.007637 -0.221932
H  5.414621 -1.280194 0.488102
H  3.807531 3.202683 0.162814
H  3.451189 2.837771 1.899591
H  2.388537 3.967135 0.975649
