program: Gaussian 09
title: 000258221
version: EM64L-G09RevD.01
frameworkgroup: C1[X(C14H20N2O2)]
method: RPBEPBE
basis: SDD
operation: Freq
keyword: #p
keyword: freq=noraman
keyword: PBEPBE/SDD
title: #p freq=noraman PBEPBE/SDD
converged: YES YES NO NO
title: Mulliken charges:
elementType: O O N N C C C C C C C C C C C C C C H H H H H H H H H H H H H H H H H H H H
charge: -0.311099 -0.309614 -0.176600 -0.151204 -0.380537 -0.407316 -0.407156 -0.364328 0.431345 0.314633 -0.365766 -0.366270 -0.370245 -0.436447 0.451708 -0.246620 -0.813145 -0.665225 0.228700 0.218115 0.230755 0.215885 0.265173 0.227037 0.245551 0.230620 0.232679 0.225439 0.222062 0.222546 0.234688 0.215943 0.220378 0.224845 0.225992 0.213867 0.222158 0.251452
chargesum: 0.00000
title: Mulliken charges with hydrogens summed into heavy atoms:
elementType: O O N N C C C C C C C C C C C C C C
charge: -0.311099 -0.309614 -0.176600 -0.151204 0.066278 0.039324 0.085055 0.111843 0.431345 0.314633 -0.133087 -0.140830 -0.148182 -0.213901 0.451708 0.204011 -0.141929 0.022251
polarizability: 2.70045672e+02 -2.65188645e+00 1.52091531e+02 6.54133824e+00 9.11434220e+00 1.13482974e+02
1716.lowfreq: -13.4252 -9.7133 -2.9361 -0.0007 -0.0006 -0.0004 8.3899 14.6495 37.7742
frequency: -11.3203 13.9821 37.6220 50.6996 69.8888 87.8068 104.1104 120.0857 130.0468 169.0039 185.7436 206.9901 234.8215 267.0747 297.7676 306.8288 321.5845 339.6347 370.5135 413.5569 429.9437 444.6511 487.4642 508.2080 517.4633 553.8044 623.1255 637.4308 674.2849 694.6904 711.3445 735.4654 788.8255 802.0497 806.8736 810.7816 836.9348 862.2523 920.9466 923.3726 950.0836 959.5456 979.4945 984.8453 1001.2701 1019.1578 1045.5392 1045.6268 1073.0742 1078.6099 1084.0331 1095.3335 1133.6460 1153.9636 1183.1980 1201.3810 1202.3819 1205.3867 1230.0934 1240.2206 1254.5096 1282.1372 1284.0589 1320.8808 1333.9454 1339.8847 1355.4153 1358.7544 1365.3252 1379.8357 1379.9510 1386.8438 1390.9241 1397.4723 1425.8582 1456.8943 1463.0917 1470.0278 1477.2880 1477.7289 1479.1779 1484.7994 1488.7730 1493.9854 1523.4235 1570.1143 1635.4875 1641.6644 2921.5303 2930.3395 2968.9155 2976.8798 2980.6498 2990.2982 3011.7791 3026.8819 3036.0754 3044.0590 3068.2384 3076.4324 3079.4437 3084.5468 3089.7094 3111.8153 3115.8895 3116.2566 3150.4317 3155.4779
redmass: 1.1704 2.7898 4.0624 2.8614 4.6123 3.2801 3.7068 3.9607 3.7324 2.7958 3.4120 3.3008 1.5254 1.8857 2.4991 2.9181 2.9893 3.3758 4.0110 2.9598 3.7726 3.4751 3.2007 3.5169 2.9376 3.6782 2.5904 6.8213 3.0378 11.2325 2.8284 3.2780 4.1502 1.6803 1.3206 1.3566 3.2559 1.5255 2.8569 1.4565 1.3659 2.1463 2.3392 1.4292 2.7952 2.5707 1.5485 2.7539 2.4584 2.2243 2.0510 2.1406 1.3650 1.6671 2.8077 1.4255 1.2077 1.2495 2.6344 1.4879 1.9105 1.2500 1.4426 1.3514 1.5771 1.3711 1.6129 1.6882 1.3685 2.2015 2.3302 1.3533 2.2660 1.2470 3.3457 1.1008 1.0509 1.0466 1.1025 1.0983 1.0861 1.0528 1.0983 1.0947 2.7746 5.7841 6.4905 9.2830 1.0697 1.0683 1.0372 1.0677 1.0671 1.0361 1.0947 1.0590 1.0913 1.0978 1.0965 1.0982 1.0951 1.0979 1.1031 1.0888 1.1055 1.0884 1.0933 1.0941
irintensity: 0.3166 0.1322 0.1663 0.0944 6.9522 0.9614 3.4961 0.1615 1.5046 5.4476 2.1575 0.3427 3.6478 0.4613 5.8277 7.6784 11.6773 7.1298 5.8253 0.9617 3.7243 1.4855 0.7232 14.6949 8.2282 2.4986 0.3496 0.0841 0.2455 18.5667 1.0873 15.8307 2.1362 65.2221 8.2270 0.5961 8.1423 4.3411 42.3350 6.6551 0.8959 4.9631 23.0899 5.2457 0.7890 3.9227 24.8801 162.5665 88.5709 55.2067 19.4079 24.3119 7.7240 42.1474 42.8673 5.8562 6.5101 218.2901 7.0602 18.5953 24.0010 11.8542 60.6423 2.5763 97.2727 42.6783 6.0200 24.4235 4.5158 136.5150 32.1729 64.6344 107.2593 10.0226 4.4201 57.2322 18.1808 11.8378 9.4086 86.9118 8.6154 22.2515 16.7597 16.5890 224.6430 11.3320 243.2350 308.5050 91.7178 42.4855 66.7996 48.7122 20.1439 22.2976 45.3354 40.4025 26.5435 27.4818 19.5390 20.9642 7.2268 40.2151 4.7461 21.0419 32.9363 33.9365 32.1956 8.2346
temp: 298.150 k
press: 1.00000 atm
elementType: 8 8 7 7 6 6 6 6 6 6 6 6 6 6 6 6 6 6 1 1 1 1 1 1 1 1 1 1 1 1 1 1 1 1 1 1 1 1
symmnumber: 1
zpe: 838692.6 jmol-1
zpe.correction: 0.319441 hartree
zpe.thermalcorrener: 0.336909 hartree
zpe.thermalcorrenthalpy: 0.337853 hartree
zpe.thermalcorrgfe: 0.272326 hartree
zpe.sumelectzpe: -804.076612 hartree
zpe.sumelectthermal: -804.059144 hartree
zpe.sumelectthermalent: -804.058200 hartree
zpe.sumelectthermalfe: -804.123728 hartree
dipole: 0.0013 -1.5809 0.6180
dipole: 1.6974
quadrupole: -106.7534 -104.1572 -109.6283
quadrupole: 9.4275 -4.5564 4.4777
quadrupole: 0.0929 2.6891 -2.7820 9.4275 -4.5564 4.4777
hfenergy: -804.3960534 hartree
pointgroup: C01 [X(C14H20N2O2)]
dipole: 0.0141546 -0.6671088 0.0268163 debye
polarizability: 270.2251252|-1.9587538|142.2234119|4.2265516|19.1950365|123.1716397 unknown
InChI: InChI=1S/C14H20N2O2/c1-3-18-14(17)16-10-8-15(9-11-16)13-6-4-12(2)5-7-13/h4-7H,3,8-11H2,1-2H3
charge 0 multiplicity 1
38 atoms
O  -4.147289 -0.999182 -0.170009
O  -4.206829 1.359725 -0.260116
N  0.702652 0.064842 -0.240551
N  -2.189117 0.168073 -0.413488
C  -0.055335 1.222367 0.275901
C  -0.055078 -0.972378 -0.961768
C  -1.372788 1.396579 -0.499652
C  -1.476808 -1.130206 -0.390545
C  2.099264 -0.00935 -0.097572
C  -3.555909 0.277651 -0.278955
C  2.793915 0.850423 0.809522
C  2.880845 -0.940935 -0.846429
C  4.192476 0.771515 0.952147
C  4.279903 -1.009096 -0.679557
C  4.972111 -0.159533 0.217983
C  -5.627971 -0.99776 0.002407
C  6.479691 -0.238433 0.392121
C  -6.009203 -0.836138 1.476646
H  0.543921 2.144009 0.143486
H  -0.273571 1.12101 1.361852
H  0.456247 -1.944668 -0.840954
H  -0.110286 -0.763044 -2.053467
H  -1.962295 2.229441 -0.081753
H  -1.15276 1.640185 -1.558552
H  -2.039145 -1.867905 -0.987438
H  -1.421029 -1.516934 0.646639
H  2.240111 1.564508 1.426998
H  2.407678 -1.59632 -1.584456
H  4.68875 1.445313 1.66284
H  4.846537 -1.736174 -1.275137
H  -6.053716 -0.183651 -0.610018
H  -5.935929 -1.977162 -0.399085
H  6.92272 -0.989571 -0.285092
H  6.966416 0.732345 0.17862
H  6.75623 -0.518937 1.426825
H  -7.105888 -0.923786 1.592147
H  -5.533427 -1.61726 2.094969
H  -5.701594 0.15544 1.848994
