program: Gaussian 09
title: 000258262
version: EM64L-G09RevD.01
frameworkgroup: C1[X(C27H23ClN2)]
method: RPBEPBE
basis: SDD
operation: Freq
keyword: #p
keyword: freq=noraman
keyword: PBEPBE/SDD
title: #p freq=noraman PBEPBE/SDD
converged: YES YES NO NO
title: Mulliken charges:
elementType: Cl N N C C C C C C C C C C C C C C C C C C C C C C C C C C C H H H H H H H H H H H H H H H H H H H H H H H
charge: -0.053394 -0.194242 -0.083330 -0.536339 -0.598103 0.504718 0.464907 0.509763 -0.546563 -0.401810 -0.372819 -0.371789 -0.437224 -0.426932 0.278637 -0.226978 -0.394018 -0.232174 -0.234232 -0.230213 -0.230381 -0.241388 -0.243967 -0.385504 0.456502 -0.362263 -0.365634 -0.218867 -0.206228 -0.100751 0.229179 0.229357 0.252073 0.229195 0.246468 0.235263 0.253090 0.253875 0.238007 0.239025 0.219747 0.239889 0.227917 0.227110 0.228186 0.226912 0.229536 0.228322 0.218303 0.233955 0.281423 0.256919 0.256864
chargesum: 0.00000
title: Mulliken charges with hydrogens summed into heavy atoms:
elementType: Cl N N C C C C C C C C C C C C C C C C C C C C C C C C C C C
charge: -0.053394 -0.194242 -0.083330 -0.077802 -0.116835 0.504718 0.464907 0.509763 -0.300095 -0.166547 -0.119728 -0.117914 -0.199217 -0.187907 0.278637 -0.007232 -0.154129 -0.004257 -0.007123 -0.002027 -0.003469 -0.011852 -0.015644 -0.167201 0.456502 -0.128308 -0.084211 0.038053 0.050636 -0.100751
polarizability: 5.69391345e+02 1.37963496e+01 2.47341456e+02 2.63343701e+00 -1.37432157e+00 2.61114061e+02
1716.lowfreq: -11.6782 -3.1463 0.0017 0.0019 0.0021 4.6776 9.0253 15.2181 18.1606
frequency: 8.4459 13.4303 17.9942 21.5069 31.9047 36.1643 47.1206 55.0035 62.5456 92.3760 95.7343 132.1575 157.0017 167.0435 181.3354 199.1349 213.5860 229.6581 258.9365 270.2862 283.9395 317.0159 352.0964 358.0238 375.7048 402.8785 405.0153 412.5048 413.3267 438.6888 453.4818 467.4171 486.7544 506.5720 523.3967 537.6617 577.6954 593.1708 616.2226 616.3773 622.3712 622.6306 635.5825 675.4610 684.1419 705.0481 707.9029 718.9443 728.6276 755.6558 756.8610 771.5046 806.5185 814.3043 824.9880 842.0494 843.5002 854.4998 856.6971 861.6260 874.9289 880.3429 915.7164 920.0000 947.2147 950.0658 956.2552 963.2146 977.9484 980.6016 982.3389 982.8678 990.0268 990.4770 991.8392 997.8885 998.0258 998.4053 1023.3701 1026.0412 1031.8797 1067.9276 1084.4779 1088.8950 1099.9282 1103.1731 1138.0411 1151.2608 1171.5315 1171.9649 1174.2635 1184.3388 1188.7263 1190.2008 1201.3977 1210.1670 1226.9918 1245.2685 1251.0108 1289.0243 1298.0921 1319.3538 1322.6939 1342.0263 1346.1656 1353.8686 1364.2696 1381.0003 1384.9722 1387.9975 1390.2554 1399.6842 1439.6918 1440.5943 1448.2566 1466.2783 1474.3368 1476.2984 1481.0054 1484.7627 1486.0872 1561.5036 1568.7527 1589.0127 1592.7586 1594.7726 1602.8450 1611.2775 1614.1899 1622.0308 2930.4126 2951.2868 3025.5218 3033.7034 3087.7197 3115.7614 3117.0577 3122.0874 3123.8275 3126.1316 3127.9157 3134.3384 3135.0398 3145.0972 3145.4397 3151.7974 3155.3458 3161.8969 3162.5223 3163.1998 3170.9760 3171.2490 3175.5211
redmass: 6.1437 4.5781 5.1780 5.1746 5.6400 4.4336 4.0620 5.7121 4.8970 5.1964 5.2547 4.9197 5.5600 5.2707 4.9263 4.8414 4.9672 4.3611 4.8547 4.6944 3.3413 4.2244 4.7105 2.6848 4.3480 2.8329 2.8367 3.3651 4.4656 2.7351 3.2178 3.2727 3.7036 3.6153 4.7811 4.0680 7.5601 4.4766 6.1788 6.3576 4.9356 6.7219 4.8249 5.8505 1.8547 2.0358 1.9071 3.4059 2.6728 1.8200 2.6529 1.5944 3.4084 3.8242 1.3358 1.9017 1.6614 1.6779 1.2708 1.2531 2.0898 3.3617 1.5248 1.4732 1.8895 1.3652 1.3518 2.3251 2.8016 1.4352 1.6563 1.3994 6.1573 6.2050 1.4596 1.3227 3.9022 1.3322 2.2584 2.2479 1.9820 2.7901 1.5597 1.5927 1.7515 1.3699 2.9706 2.2528 1.0569 1.0574 1.1217 1.1126 1.1185 1.1567 2.7837 2.4528 1.7921 1.4180 1.8439 1.3068 1.4316 1.3561 1.2824 1.5959 1.7201 1.5692 2.2846 5.6640 4.6265 3.7949 3.1750 3.3376 2.2705 2.1886 2.8058 1.2198 1.4191 2.6233 2.6127 2.0369 1.5457 5.4457 7.5260 6.1799 5.9920 6.0901 6.5892 5.9544 6.0620 6.6157 1.0685 1.0861 1.0631 1.0904 1.0985 1.0866 1.0862 1.0865 1.0866 1.0862 1.0899 1.0913 1.0918 1.0961 1.0961 1.0934 1.0885 1.1015 1.1014 1.0901 1.0950 1.0953 1.0973
irintensity: 0.1248 0.2405 0.1112 0.2529 0.1805 0.1540 0.0578 0.6646 0.8182 0.4710 2.7135 2.4945 1.1292 0.8235 2.9842 2.1088 4.2957 0.7394 2.1214 11.2284 3.6893 4.7807 1.5742 8.1876 4.2562 0.1377 0.3066 7.3746 24.4362 6.0347 2.3575 3.5203 17.1331 20.3365 8.6612 14.0727 2.4664 14.9174 0.3797 0.1478 4.7316 0.4806 7.8867 4.2439 27.6967 66.7911 35.1058 7.7783 2.2192 73.9298 4.6401 56.4663 14.1456 8.1174 26.0830 29.8674 28.2115 7.0922 0.3397 0.4457 26.6344 14.2709 6.1259 21.8231 34.4622 2.7691 0.8203 24.1673 39.2634 3.0130 17.4356 1.6056 0.0310 1.2313 10.1542 0.8978 43.6202 1.3653 18.2350 7.1262 2.5232 67.2280 9.9165 17.8255 12.0093 11.3014 23.5112 53.8425 0.4369 0.2221 5.0813 5.0216 2.4691 0.9302 9.3664 4.5341 70.5635 47.7523 27.0857 7.2871 0.6680 15.9277 6.8777 10.4588 20.1321 2.4733 79.3325 2.8005 4.2801 4.0097 2.5127 13.7693 35.0837 37.1834 9.2539 34.6085 11.2443 21.4053 159.4332 33.9977 15.8072 46.7002 117.1798 229.3424 3.2927 6.2348 55.8658 5.0484 6.3090 87.0961 56.5567 51.1526 30.8345 13.4831 11.8256 14.2813 1.3454 0.7945 0.6309 13.4712 8.7040 17.0650 11.3731 20.3085 54.5883 18.5689 0.1913 28.7414 28.2486 8.2164 22.6785 5.8291 4.5419
temp: 298.150 k
press: 1.00000 atm
elementType: 17 7 7 6 6 6 6 6 6 6 6 6 6 6 6 6 6 6 6 6 6 6 6 6 6 6 6 6 6 6 1 1 1 1 1 1 1 1 1 1 1 1 1 1 1 1 1 1 1 1 1 1 1
symmnumber: 1
zpe: 1104242.6 jmol-1
zpe.correction: 0.420584 hartree
zpe.thermalcorrener: 0.446550 hartree
zpe.thermalcorrenthalpy: 0.447494 hartree
zpe.thermalcorrgfe: 0.358205 hartree
zpe.sumelectzpe: -1610.143699 hartree
zpe.sumelectthermal: -1610.117733 hartree
zpe.sumelectthermalent: -1610.116788 hartree
zpe.sumelectthermalfe: -1610.206078 hartree
dipole: 2.9671 -0.7693 1.1274
dipole: 3.2660
quadrupole: -178.1571 -177.1178 -174.2410
quadrupole: 8.1259 -13.4590 -0.1090
quadrupole: -1.6518 -0.6125 2.2643 8.1259 -13.4590 -0.1090
hfenergy: -1610.5642823 hartree
pointgroup: C01 [X(C27H23Cl1N2)]
dipole: -0.9995861 0.5881322 0.5531463 debye
polarizability: 530.5444871|-105.4020473|286.4355027|-9.2080568|0.2678517|260.8668719 unknown
InChI: InChI=1S/C27H23ClN2/c28-25-16-14-22(15-17-25)19-29-26-12-7-13-27(18-26)30(20-23-8-3-1-4-9-23)21-24-10-5-2-6-11-24/h1-19H,20-21H2
charge 0 multiplicity 1
53 atoms
Cl 8.66876 -3.427751 -2.141267
N  -1.666755 1.033982 0.405604
N  2.664608 -1.217634 0.445838
C  -2.757829 1.72418 1.127765
C  -1.980814 0.658545 -0.997893
C  -0.664855 0.348274 1.133994
C  -3.265967 2.964802 0.395241
C  -3.069685 -0.413743 -1.114245
C  0.504583 -0.147759 0.485888
C  -0.767377 0.146499 2.547347
C  -2.35642 3.955015 -0.05719
C  -2.843869 -1.731211 -0.634683
C  -4.653404 3.171577 0.205922
C  -4.323917 -0.105179 -1.697086
C  1.547383 -0.77233 1.209088
C  0.266578 -0.496764 3.260833
C  1.429595 -0.960657 2.6182
C  -2.826578 5.129408 -0.683746
C  -3.850495 -2.715946 -0.73911
C  -5.128717 4.349766 -0.416268
C  -5.332848 -1.090541 -1.806457
C  -4.216367 5.332186 -0.863514
C  -5.098769 -2.399303 -1.327129
C  3.869838 -1.259017 0.95829
C  5.017831 -1.784162 0.199248
C  6.311577 -1.786089 0.788125
C  4.85992 -2.294332 -1.120666
C  7.429071 -2.283653 0.084558
C  5.964479 -2.793391 -1.835264
C  7.235295 -2.780237 -1.219158
H  -3.611623 1.041319 1.333547
H  -2.355223 2.048731 2.104197
H  -2.302395 1.567859 -1.535687
H  -1.057339 0.310589 -1.486349
H  0.658573 -0.033435 -0.590412
H  -1.669157 0.441404 3.090146
H  -1.280786 3.790735 0.08026
H  -1.878692 -1.982709 -0.179467
H  -5.363753 2.406993 0.544881
H  -4.509392 0.910833 -2.068002
H  0.140929 -0.659865 4.337588
H  2.201539 -1.499349 3.177724
H  -2.113981 5.887495 -1.02824
H  -3.661558 -3.730059 -0.368932
H  -6.205823 4.497436 -0.554348
H  -6.296231 -0.837796 -2.263974
H  -4.582031 6.244657 -1.34773
H  -5.8779 -3.165357 -1.411743
H  4.09647 -0.881591 1.978227
H  6.446876 -1.395083 1.804011
H  3.858491 -2.287481 -1.562025
H  8.424926 -2.285443 0.536408
H  5.848328 -3.186411 -2.849345
