program: Gaussian 09
title: 000258294
version: EM64L-G09RevD.01
frameworkgroup: C1[X(C16H21BrN2O9)]
method: RPBEPBE
basis: SDD
operation: Freq
keyword: #p
keyword: freq=noraman
keyword: PBEPBE/SDD
title: #p freq=noraman PBEPBE/SDD
converged: YES YES NO NO
title: Mulliken charges:
elementType: Br O O O O O O O O O N N C C C C C C C C C C C C C C C C H H H H H H H H H H H H H H H H H H H H H
charge: 0.054039 -0.265632 -0.279902 -0.258424 -0.264467 -0.261981 -0.194195 -0.267457 -0.241823 -0.272048 -0.100467 -0.381384 -0.003772 -0.530205 -0.092642 -0.015885 -0.078449 -0.358825 -0.370509 0.272860 0.221237 -0.654618 0.329884 0.359070 0.324462 -0.772660 -0.755906 -0.758153 0.244844 0.256286 0.281234 0.295956 0.271690 0.326386 0.268815 0.235088 0.364266 0.276469 0.250654 0.236788 0.290934 0.240495 0.244120 0.267288 0.250198 0.250305 0.279812 0.240484 0.245742
chargesum: 0.00000
title: Mulliken charges with hydrogens summed into heavy atoms:
elementType: Br O O O O O O O O O N N C C C C C C C C C C C C C C C C
charge: 0.054039 -0.265632 -0.279902 -0.258424 -0.264467 -0.261981 -0.194195 -0.267457 -0.241823 -0.272048 -0.100467 -0.017118 0.241072 0.007315 0.203314 0.255804 0.247936 -0.358825 0.133393 0.272860 0.221237 0.109293 0.329884 0.359070 0.324462 0.002888 0.011885 0.007886
polarizability: 2.83171720e+02 5.62068354e+00 2.11121488e+02 7.02264702e+00 -1.80187942e+00 2.00419495e+02
1716.lowfreq: -14.8922 -6.1291 -0.0008 -0.0001 0.0004 4.2523 14.0715 21.3189 23.8283
frequency: 14.0043 21.2728 23.7968 41.3812 44.4346 56.4361 57.9388 62.3967 72.3309 79.0542 87.1832 89.6180 99.4811 104.5525 113.6313 116.9737 131.1610 141.4077 160.5347 178.5260 181.5543 195.3399 203.4451 204.7338 215.3673 235.2052 250.8402 267.1771 282.2464 293.9666 300.0537 344.3078 373.9366 385.0682 406.0994 423.9981 443.5562 468.0703 514.1703 533.2556 540.1451 545.3466 556.9663 558.6345 567.9170 593.4454 604.5450 622.0001 627.5648 672.6292 680.8490 689.6730 714.2507 738.2689 760.9694 769.7930 788.9749 805.3866 812.7724 843.6582 846.2772 864.1604 893.1117 910.9858 933.6757 954.2173 962.0040 980.9644 996.0213 1001.3867 1007.1941 1009.8504 1041.5043 1047.8949 1049.7512 1052.2649 1055.8793 1082.2690 1111.4331 1147.7603 1153.7564 1166.5219 1180.2093 1190.2076 1199.4003 1206.9527 1216.2653 1225.8807 1242.5273 1252.8842 1273.6489 1284.6076 1296.5465 1307.7453 1328.4419 1341.9465 1347.0649 1367.4047 1372.1535 1376.2505 1383.4704 1384.3840 1384.9334 1393.8363 1438.7176 1450.5551 1451.1987 1452.1602 1452.9051 1454.2741 1457.0177 1457.2458 1460.8393 1463.1269 1475.7743 1634.3646 1643.6479 1650.1719 1650.5646 1664.6328 3002.3007 3003.7510 3007.6851 3007.7420 3024.7643 3042.5531 3052.8418 3058.5181 3072.4268 3079.1343 3099.5728 3100.7830 3101.1788 3104.6753 3119.0930 3123.2884 3131.1326 3140.3853 3141.7344 3144.3813 3519.2955
redmass: 6.7219 5.8442 6.1913 7.3473 7.1779 5.5296 5.4473 4.4233 7.7043 5.0969 1.2711 3.9178 5.8527 3.7711 1.0301 1.0422 12.0934 5.5834 5.8074 6.2164 7.4993 8.0450 1.7704 1.9825 8.2410 3.2162 5.1672 3.7818 3.7270 3.2351 4.1051 5.6170 5.2109 5.8490 3.8793 2.5803 4.7742 4.5070 4.9152 3.3894 6.8900 4.2604 3.5257 3.4026 3.5221 5.6240 5.0596 4.7469 5.5942 3.6759 4.9710 2.4355 5.2560 5.9684 5.7665 2.1730 4.6691 4.1406 3.7020 5.0185 5.9226 5.8071 4.3752 4.7917 2.7077 3.4235 2.5813 2.1217 2.2881 2.0568 2.2453 2.6380 1.6608 1.6482 1.6964 1.7838 1.9280 2.6519 3.1601 2.6921 2.5008 4.2296 2.6819 2.9004 1.6953 2.1220 1.6968 2.4861 1.7354 2.9023 1.2297 1.3896 1.3111 1.3036 1.3869 2.6265 1.5857 1.6124 1.3751 1.8441 1.2519 1.2323 1.2369 1.1976 1.1683 1.1636 1.0585 1.0569 1.0734 1.0555 1.2406 1.0777 1.0581 1.0577 1.0841 11.0341 9.8030 6.9444 6.5563 9.7113 1.0387 1.0386 1.0361 1.0382 1.0851 1.0573 1.0631 1.0859 1.0864 1.0869 1.0932 1.0933 1.0944 1.0991 1.1077 1.1040 1.1005 1.1027 1.1028 1.1024 1.0768
irintensity: 0.3157 0.4166 0.3362 0.9454 3.3083 0.0854 5.0387 2.3590 0.3997 1.4846 0.5153 3.7701 1.9018 5.2065 0.4081 0.2156 1.3255 5.0469 3.1143 5.2079 1.3369 4.7714 3.2464 3.9071 1.5234 1.2159 1.3054 10.2098 1.5206 15.0931 2.7841 3.3514 30.6491 18.8988 12.1185 8.2777 13.7202 20.5517 10.3335 7.2566 25.0948 8.2233 4.1669 12.9646 7.4820 1.4039 1.4941 8.5150 1.6062 5.6066 3.0113 37.1827 9.4851 13.3120 59.9970 45.8215 45.8822 22.9335 23.0974 98.5477 147.1017 37.0745 59.2990 133.7751 2.6202 111.9200 25.2283 28.7290 57.4848 66.1754 239.6362 37.5350 12.4701 16.6700 14.0898 40.6603 8.9733 4.9047 52.8863 83.5241 53.7419 100.9081 89.3496 135.7741 208.0548 225.4514 292.3862 39.2533 17.1751 270.7498 1.1457 9.7972 21.3139 5.5512 5.4625 109.0187 28.1383 3.4164 62.8676 11.2238 60.1077 53.8591 76.2765 32.0829 41.9783 13.4133 29.9974 26.4375 19.1988 8.1114 52.5331 42.6782 14.3166 13.5094 16.3303 198.5720 188.1384 212.9724 446.7513 159.2272 3.3305 0.9646 5.3889 0.4049 8.9485 21.3214 4.8639 9.8986 10.1682 7.8140 6.9186 7.2019 5.5688 7.2187 6.2781 4.8945 3.4104 7.5164 8.6269 6.2193 67.1764
temp: 298.150 k
press: 1.00000 atm
elementType: 35 8 8 8 8 8 8 8 8 8 7 7 6 6 6 6 6 6 6 6 6 6 6 6 6 6 6 6 1 1 1 1 1 1 1 1 1 1 1 1 1 1 1 1 1 1 1 1 1
symmnumber: 1
zpe: 968211.8 jmol-1
zpe.correction: 0.368772 hartree
zpe.thermalcorrener: 0.398812 hartree
zpe.thermalcorrenthalpy: 0.399756 hartree
zpe.thermalcorrgfe: 0.303685 hartree
zpe.sumelectzpe: -1420.201021 hartree
zpe.sumelectthermal: -1420.170982 hartree
zpe.sumelectthermalent: -1420.170037 hartree
zpe.sumelectthermalfe: -1420.266108 hartree
dipole: 0.7620 1.7225 -0.8786
dipole: 2.0784
quadrupole: -187.0673 -164.7318 -174.7014
quadrupole: 7.6388 -10.6448 5.8353
quadrupole: -11.5672 10.7684 0.7988 7.6388 -10.6448 5.8353
hfenergy: -1420.5697932 hartree
pointgroup: C01 [X(C16H21Br1N2O9)]
dipole: 0.2752992 0.3800999 -0.669606 debye
polarizability: 283.8477793|4.123532|205.9085636|-2.5620127|-6.0270129|204.9563596 unknown
InChI: InChI=1S/C16H21BrN2O9/c1-7(20)25-6-11-10(26-8(2)21)5-12(28-11)19-14(27-9(3)22)16(4,17)13(23)18-15(19)24/h10-12,14,18H,5-6H2,1-4H3
charge 0 multiplicity 1
49 atoms
Br 4.26617 -2.398475 0.194216
O  -0.415487 0.710677 -0.333851
O  -2.627364 -1.405985 -0.340357
O  2.81904 1.269212 -1.406534
O  -3.756906 1.452683 1.102291
O  1.106483 0.482456 2.308974
O  5.64039 0.726152 1.347651
O  -4.339824 -1.996983 1.140223
O  1.607256 0.518018 -3.262791
O  -5.361686 0.893176 -0.503593
N  1.776463 -0.237701 0.169248
N  3.352205 0.617393 1.739043
C  0.384475 -0.526698 -0.268318
C  -0.385287 -1.520587 0.643613
C  -1.790654 -0.909674 0.791795
C  -1.536943 0.605955 0.640001
C  2.799534 -0.136397 -0.856441
C  4.225051 -0.394467 -0.333867
C  -2.683232 1.442793 0.072425
C  2.002376 0.2929 1.442888
C  4.497354 0.361709 0.977245
C  5.315742 -0.165039 -1.375595
C  -3.904051 -1.916579 -0.031018
C  2.101937 1.463819 -2.616522
C  -5.057713 1.119342 0.690042
C  -4.64283 -2.29168 -1.29043
C  2.026864 2.931924 -2.945108
C  -5.979334 1.031228 1.881205
H  0.471565 -0.8943 -1.304371
H  -0.432245 -2.523985 0.193315
H  0.090449 -1.592703 1.632916
H  -2.294182 -1.164104 1.738482
H  -1.19903 1.000987 1.616493
H  2.559051 -0.818144 -1.68953
H  -3.066709 1.030034 -0.874182
H  -2.357464 2.486119 -0.070861
H  3.49019 1.070763 2.64842
H  6.299118 -0.408321 -0.9459
H  5.321445 0.899314 -1.669234
H  5.141107 -0.785892 -2.269855
H  -5.222051 -1.407545 -1.616465
H  -5.3473 -3.111371 -1.081891
H  -3.946806 -2.569019 -2.09629
H  1.214872 3.384158 -2.346508
H  1.795852 3.065621 -4.011999
H  2.963896 3.447078 -2.681407
H  -5.928896 -0.002032 2.272738
H  -7.014782 1.23745 1.570873
H  -5.666509 1.719719 2.680726
