program: Gaussian 09
title: 000004004
version: EM64L-G09RevD.01
frameworkgroup: C1[X(C10H19O6PS2)]
method: RPBEPBE
basis: SDD
operation: Freq
keyword: #p
keyword: freq=noraman
keyword: PBEPBE/SDD
title: #p freq=noraman PBEPBE/SDD
converged: YES YES NO NO
title: Mulliken charges:
elementType: S S P O O O O O O C C C C C C C C C C H H H H H H H H H H H H H H H H H H H
charge: 0.028209 -0.235223 0.635024 -0.278268 -0.259561 -0.454380 -0.471019 -0.225030 -0.254263 -0.550829 -0.528119 0.365865 0.299075 -0.217677 -0.228986 -0.672160 -0.670289 -0.487037 -0.497902 0.350116 0.267116 0.286597 0.230146 0.234906 0.229488 0.233596 0.215641 0.227286 0.235408 0.214436 0.230044 0.234304 0.241755 0.231748 0.277201 0.242499 0.285629 0.234657
chargesum: 0.00000
title: Mulliken charges with hydrogens summed into heavy atoms:
elementType: S S P O O O O O O C C C C C C C C C C
charge: 0.028209 -0.235223 0.635024 -0.278268 -0.259561 -0.454380 -0.471019 -0.225030 -0.254263 -0.200713 0.025593 0.365865 0.299075 0.247375 0.234098 0.006175 0.008494 0.263667 0.264883
polarizability: 2.18700865e+02 1.81383670e+01 2.21038337e+02 3.10661665e+00 2.36370427e+00 1.51867502e+02
1716.lowfreq: -11.1402 -7.0651 -0.0018 -0.0017 0.0010 7.2717 11.5715 17.0016 20.2560
frequency: 8.9192 16.5982 20.0430 42.2749 44.1588 60.3008 63.7249 74.2148 89.3084 99.3848 109.5186 111.2226 120.2710 129.1835 131.2578 136.0212 141.1523 155.9608 166.4372 191.4287 211.5233 226.8775 239.8394 255.2420 256.2984 276.2599 313.4898 328.5487 346.7376 351.8571 365.7268 384.7097 400.9451 434.9838 525.5896 550.1076 630.1962 654.9275 663.6367 674.3317 691.6812 750.3731 799.1005 799.6425 805.2127 821.8966 907.8649 928.7715 943.5600 962.1017 978.8132 1019.8492 1023.2830 1070.0995 1110.8376 1114.3261 1124.0252 1127.1046 1130.5527 1131.4095 1135.2842 1136.3434 1137.6365 1138.3116 1186.9595 1245.2282 1249.7347 1250.6901 1258.1427 1337.7269 1356.4695 1363.4105 1401.4726 1402.6827 1424.5291 1428.1238 1439.7058 1456.5254 1459.5183 1464.0424 1464.7679 1467.7230 1473.1923 1473.5785 1475.0782 1486.0390 1486.1489 1636.9901 1647.2653 2984.9944 2989.2421 2997.0497 2997.8034 3004.1479 3009.6993 3012.9686 3013.8965 3072.8179 3073.7703 3080.3062 3093.7304 3094.4148 3095.8556 3104.3550 3109.9319 3110.4406 3132.9522 3133.2628
redmass: 5.0148 4.6870 4.1896 4.5003 2.6164 2.9768 6.8012 5.4015 5.0885 1.2392 3.4848 3.9377 2.4514 1.6178 3.3092 2.4424 2.3935 4.1966 4.0771 3.7771 6.5195 3.3056 2.8035 1.5476 1.6502 5.2408 4.8785 5.7767 4.9981 4.7582 5.1067 6.3828 4.6312 5.0784 17.6781 3.3595 5.7215 6.4241 10.5500 4.5503 11.8520 7.2665 1.0992 1.1029 3.8949 3.6598 4.9250 4.1236 10.8773 2.7629 9.9081 2.2924 2.4588 4.7389 2.4299 2.2668 1.2493 1.3478 2.0867 1.4742 1.5205 1.5108 1.3063 1.8303 1.4837 1.3255 1.1418 1.1451 1.2583 1.4438 1.3610 1.5454 1.2626 1.2672 1.1182 1.1160 1.0827 1.0478 1.0494 1.0397 1.0400 1.0525 1.0614 1.0626 1.0522 1.0667 1.0677 9.8070 11.1332 1.0302 1.0302 1.0359 1.0359 1.0633 1.0820 1.0581 1.0585 1.1068 1.1067 1.0974 1.0985 1.0985 1.1046 1.1030 1.1030 1.1028 1.1035 1.1053
irintensity: 0.1122 0.2589 0.5032 0.6582 0.2840 1.1828 1.2930 0.6704 1.4489 0.4991 3.3136 1.5383 2.5877 1.6261 4.7391 2.9616 7.5052 5.0953 5.9260 6.1917 1.2072 16.2220 6.5172 1.3920 10.0725 0.8936 14.3534 10.3898 25.6999 10.6057 1.5921 23.2939 3.9873 16.9758 168.1588 3.6488 15.8830 3.9244 51.8430 1.6448 122.5280 5.0585 4.4005 3.8393 10.5368 0.1064 35.3602 4.5845 256.6762 96.0161 10.7877 64.5993 101.8212 40.5777 48.0294 9.5071 3.9224 41.1728 235.9589 93.0932 15.5135 35.2708 6.3161 175.3082 141.5853 115.5584 3.6466 7.4604 4.4456 43.3877 1.4007 14.6662 23.6488 19.5662 9.6708 10.8012 34.7367 7.3241 9.3326 12.3870 12.6342 18.5727 8.5012 4.6356 12.4846 13.3213 13.7411 172.9213 150.0328 48.4543 42.1298 19.6972 20.8013 8.4097 25.6276 14.8583 13.5548 6.2883 5.0548 1.1641 29.2154 24.8100 8.9400 3.7929 39.4461 40.0161 8.4217 8.1881
temp: 298.150 k
press: 1.00000 atm
elementType: 16 16 15 8 8 8 8 8 8 6 6 6 6 6 6 6 6 6 6 1 1 1 1 1 1 1 1 1 1 1 1 1 1 1 1 1 1 1
symmnumber: 1
zpe: 761056.3 jmol-1
zpe.correction: 0.289871 hartree
zpe.thermalcorrener: 0.315582 hartree
zpe.thermalcorrenthalpy: 0.316526 hartree
zpe.thermalcorrgfe: 0.229004 hartree
zpe.sumelectzpe: -1979.624704 hartree
zpe.sumelectthermal: -1979.598994 hartree
zpe.sumelectthermalent: -1979.598049 hartree
zpe.sumelectthermalfe: -1979.685572 hartree
dipole: 4.7099 3.4482 0.8523
dipole: 5.8991
quadrupole: -123.0356 -121.9849 -139.5171
quadrupole: -12.7289 1.1829 -1.7498
quadrupole: 5.1436 6.1943 -11.3379 -12.7289 1.1829 -1.7498
hfenergy: -1979.9145754 hartree
pointgroup: C01 [X(C10H19O6P1S2)]
dipole: 1.211718 1.8346106 0.74328 debye
polarizability: 205.3957328|11.21366|230.1611957|11.7480773|14.1348424|156.0497753 unknown
InChI: InChI=1S/C8H13O4S.C2H6O2PS/c1-3-11-7(9)5-6(13)8(10)12-4-2;1-3-5(6)4-2/h6H,3-5H2,1-2H3;1-2H3
charge 0 multiplicity 1
38 atoms
S  -0.172903 -0.957428 -1.533938
S  -1.798552 -4.200684 -1.309061
P  -1.725888 -2.311765 -0.484305
O  -1.030387 2.582482 0.341745
O  3.577073 0.297825 0.023468
O  -3.16972 -1.364982 -0.39961
O  -1.398109 -2.131072 1.205011
O  -2.005338 1.561886 -1.508429
O  1.987623 -0.806236 1.316326
C  -0.127023 0.462151 -0.272641
C  1.310622 1.024848 -0.20768
C  -1.157254 1.553371 -0.593166
C  2.28064 0.059954 0.459493
C  -2.017075 3.705784 0.226552
C  4.651921 -0.544234 0.645046
C  -1.692688 4.692465 1.342109
C  5.975272 -0.075233 0.051624
C  -3.877922 -1.089245 -1.674889
C  -0.391926 -3.030428 1.828331
H  -0.385263 0.015393 0.707349
H  1.691915 1.296708 -1.206428
H  1.289064 1.953096 0.395965
H  -1.917425 4.148806 -0.780626
H  -3.030975 3.276888 0.318586
H  4.603419 -0.411723 1.740953
H  4.431375 -1.601586 0.413155
H  -2.401997 5.539321 1.30711
H  -0.670213 5.093046 1.233774
H  -1.776789 4.210591 2.330884
H  6.804849 -0.670192 0.475049
H  6.157551 0.988086 0.282733
H  5.982589 -0.200479 -1.04435
H  -4.839567 -0.658739 -1.359391
H  -4.044794 -2.024998 -2.239621
H  -3.304638 -0.355937 -2.266647
H  -0.620765 -2.983929 2.903468
H  0.619816 -2.640691 1.63252
H  -0.50962 -4.063919 1.454631
