program: Gaussian 09
title: 000258184
version: EM64L-G09RevD.01
frameworkgroup: C1[X(C8H6N4O3)]
method: RPBEPBE
basis: SDD
operation: Freq
keyword: #pfreq=noraman
keyword: PBEPBE/SDD
title: #p freq=noraman PBEPBE/SDD
converged: NO YES NO NO
title: Mulliken charges:
elementType: O O O N N N N C C C C C C C C H H H H H H
charge: -0.183173 -0.265644 -0.222296 -0.478619 0.031266 -0.425323 -0.010422 0.369371 0.189425 -0.293299 -0.328755 -0.218566 -0.219790 0.304513 -0.042982 0.318782 0.289802 0.340498 0.245604 0.247758 0.351850
chargesum: 0.00000
title: Mulliken charges with hydrogens summed into heavy atoms:
elementType: O O O N N N N C C C C C C C C
charge: -0.183173 -0.265644 -0.222296 -0.138121 0.031266 -0.073472 -0.010422 0.369371 0.189425 0.025483 -0.038953 0.027038 0.027968 0.304513 -0.042982
polarizability: 2.21607778e+02 4.78182914e-01 1.48632330e+02 -4.18548153e-03 2.78486213e-03 4.80367560e+01
1716.lowfreq: -7.3622 -5.5076 -5.1667 -0.0009 -0.0007 -0.0006 46.4832 55.5473 80.8067
frequency: 46.4246 55.5202 80.8040 82.4735 116.2401 161.9928 179.6617 252.7124 273.8658 318.5718 330.9669 410.6288 422.3814 426.0497 448.7922 515.3489 526.3527 538.6627 599.7826 656.2278 663.4535 706.0393 721.7649 750.7699 784.3286 792.4890 840.9258 888.2301 896.6529 958.4672 984.4384 1009.0379 1034.9642 1062.7040 1105.3361 1135.8373 1150.0553 1183.9235 1206.1391 1247.6947 1316.9470 1343.5806 1385.3431 1434.5105 1443.7181 1484.5736 1537.0989 1600.4021 1615.6960 1669.4634 2225.0280 3145.1639 3150.5720 3169.9233 3189.9610 3195.1859 3510.3112
redmass: 8.7738 8.1113 6.5827 9.6655 4.9138 6.6373 11.2866 8.2951 4.9682 9.2802 9.0709 9.6929 3.6776 11.4095 1.9740 3.4699 7.6534 2.5556 7.4381 8.2982 5.7102 9.6634 4.6406 7.8336 1.3559 7.8790 6.4740 1.1223 1.3669 8.0254 1.3416 1.3246 2.9206 3.5635 4.3055 2.8748 1.8720 1.1983 3.2389 1.6433 2.9727 3.6427 4.6197 2.4034 1.9113 3.0760 2.8389 2.9006 6.2051 4.9695 12.3835 1.0820 1.0882 1.0922 1.0954 1.0972 1.0772
irintensity: 3.1037 14.7625 10.0364 7.4034 0.7540 0.0062 8.0051 1.0795 0.0607 1.5166 2.9736 1.8409 0.2655 0.9842 25.7153 2.3588 3.2237 71.7966 4.0810 7.0184 17.5833 7.6414 8.1628 8.2995 79.3531 2.8676 2.8937 132.1099 11.3144 25.3986 5.2003 2.1251 15.6845 2.7781 12.4708 150.6103 114.3129 50.8273 295.3536 50.8231 94.4553 477.7522 35.8644 59.5132 473.3013 152.5910 165.0157 415.7974 81.0346 111.5494 128.7267 194.7847 1.6577 6.5544 6.4873 10.8130 38.0828
temp: 298.150 k
press: 1.00000 atm
elementType: 8 8 8 7 7 7 7 6 6 6 6 6 6 6 6 1 1 1 1 1 1
symmnumber: 1
zpe: 370747.8 jmol-1
zpe.correction: 0.141210 hartree
zpe.thermalcorrener: 0.154061 hartree
zpe.thermalcorrenthalpy: 0.155006 hartree
zpe.thermalcorrgfe: 0.100603 hartree
zpe.sumelectzpe: -751.984918 hartree
zpe.sumelectthermal: -751.972067 hartree
zpe.sumelectthermalent: -751.971123 hartree
zpe.sumelectthermalfe: -752.025525 hartree
dipole: 4.9341 0.9553 0.0075
dipole: 5.0258
quadrupole: -109.9290 -87.1027 -86.5598
quadrupole: 21.2309 -0.0030 -0.0169
quadrupole: -15.3985 7.4278 7.9706 21.2309 -0.0030 -0.0169
hfenergy: -752.1261281 hartree
pointgroup: C01 [X(C8H6N4O3)]
dipole: -1.9500307 -0.3271834 0.0029312 debye
dipolederiv: -0.8717361 0.3986747 0.0005394 0.3553115 -0.7048128 -0.0001286 -0.0016795 0.0013026 -0.209921 -0.6715222 -0.3321507 -0.0004356 -0.0789141 -0.6894542 -0.0003059 0.0003554 0.0009627 -0.2729065 -0.7861321 0.0714891 -0.0000564 0.1662816 -0.8765577 0.0000255 0.0002672 -0.0004269 -0.3356916 -2.5444277 0.1480715 -0.0001931 0.1982902 -0.4579767 0.0000002 -0.0003914 -0.0000176 -0.3095979 1.1672704 -0.0803139 -0.000188 -0.4999523 1.8553374 -0.0001208 0.0011967 -0.0016272 0.2093092 -1.7256175 -0.2105211 0.0000298 -0.5918574 -0.3422623 -0.0000493 0.0002082 0.0000008 -0.3232479 -0.4818304 -0.0862307 -0.0000178 0.0363755 -0.1814588 0.0000207 0.000091 0.0000494 -0.2361206 1.3590403 -0.1114376 0.0002578 0.9398721 0.3485063 0.0001749 0.0003693 -0.0001916 0.1345987 -0.1862556 -0.0777726 -0.0000193 0.4394078 -0.9321173 0.0003551 -0.0000313 -0.0002656 -0.0005407 -0.3951894 -0.1145489 -0.0000476 -0.6653748 -0.1886491 -0.0001011 -0.0002486 0.0000828 -0.1518305 -0.1304293 0.3356798 -0.0000853 -0.2630745 0.3144006 0.0000477 0.000053 -0.0002168 -0.0830855 0.481665 -0.1798493 0.0000824 0.0210066 0.2927838 0.0001087 0.0000267 0.0000985 -0.0926041 -0.1025375 0.2191043 0.0000637 0.3828473 -0.4136488 0.0000911 0.0002569 -0.0001078 -0.1624565 3.0830849 0.0975116 0.0001049 0.1032088 1.3611939 0.0000957 -0.0004703 0.0004992 0.3650893 1.0723302 -0.0299825 -0.0002398 -0.3042794 -0.0566941 0.0000091 -0.000426 -0.0000256 0.1131279 0.1425009 0.0584176 0.000007 0.0295483 0.1150396 -0.0000135 0.0001183 0.0000155 0.1807746 0.087139 0.0091164 0.000029 0.0730704 0.0919745 -0.0000456 -0.0000619 0.0000047 0.1688728 0.3271269 -0.0585403 0.0001136 -0.294442 0.2927165 -0.0000458 0.0003166 -0.0000718 0.3118991 0.1025642 -0.0097685 -0.0000031 -0.0248927 -0.0725525 -0.0000667 -0.0000242 -0.0001396 0.1512681 -0.0519089 -0.0720908 -0.0000446 -0.0630134 0.0549048 -0.0000136 -0.0001316 0.0000875 0.1661052 0.1248646 0.0251418 0.0001029 0.0405808 0.1893268 -0.0000378 0.0002055 -0.0000131 0.3769579 unknown
polarizability: 221.5860565|-1.3465877|148.6540511|0.0041145|-0.0028886|48.036756 unknown
InChI: InChI=1S/C8H6N4O3/c9-5-10-8(13)11-6-3-1-2-4-7(6)12(14)15/h1-4,10-11H
charge 0 multiplicity 1
21 atoms
O  -2.962851 2.468194 -0.00113
O  -0.692912 2.479435 -0.000988
O  2.138468 -1.58024 -0.00005
N  0.611639 0.243149 0.000982
N  -1.844096 1.837167 0.001304
N  2.901629 0.641583 0.000822
N  5.380095 0.03275 -0.000303
C  -0.631314 -0.407626 0.000639
C  -1.845643 0.370083 0.000834
C  -0.758651 -1.827454 0.000148
C  -3.119231 -0.256981 0.000474
C  -2.026262 -2.431332 -0.000161
C  -3.214227 -1.654103 -0.000002
C  1.87474 -0.35437 0.000825
C  4.215411 0.304295 0.000212
H  0.151172 -2.430134 0.000034
H  -4.007143 0.379839 0.000613
H  0.500853 1.281503 0.001421
H  -2.090498 -3.524504 -0.000543
H  -4.195107 -2.137728 -0.000257
H  2.661229 1.637273 0.001222
