program: Gaussian 09
title: 000258245
version: EM64L-G09RevD.01
frameworkgroup: C1[X(C18H20N4O8S2)]
method: RPBEPBE
basis: SDD
operation: Freq
keyword: #p
keyword: freq=noraman
keyword: PBEPBE/SDD
title: #p freq=noraman PBEPBE/SDD
converged: NO YES NO NO
title: Mulliken charges:
elementType: S S O O O O O O O O N N N N C C C C C C C C C C C C C C C C C C H H H H H H H H H H H H H H H H H H H H
charge: 0.892476 0.892473 -0.515126 -0.532012 -0.515121 -0.532015 -0.191841 -0.191835 -0.191118 -0.191127 -0.234305 -0.234312 0.022498 0.022509 -0.438948 -0.425393 -0.438947 -0.425385 0.018013 0.018058 -0.358521 -0.358565 -0.277091 -0.277097 0.229589 0.229640 -0.357297 -0.357313 0.386736 0.386660 -0.762963 -0.762930 0.287683 0.282455 0.299673 0.246428 0.282456 0.287690 0.246423 0.299665 0.324218 0.324217 0.301740 0.301751 0.254813 0.254825 0.262969 0.257536 0.217790 0.217766 0.262936 0.257575
chargesum: 0.00000
title: Mulliken charges with hydrogens summed into heavy atoms:
elementType: S S O O O O O O O O N N N N C C C C C C C C C C C C C C C C C C
charge: 0.892476 0.892473 -0.515126 -0.532012 -0.515121 -0.532015 -0.191841 -0.191835 -0.191118 -0.191127 -0.234305 -0.234312 0.022498 0.022509 0.131190 0.120708 0.131199 0.120703 0.018013 0.018058 -0.034304 -0.034348 0.024649 0.024655 0.229589 0.229640 -0.102483 -0.102488 0.386736 0.386660 -0.024668 -0.024653
polarizability: 4.89307628e+02 -2.02439215e-02 2.89402484e+02 -2.49849946e+01 -1.49861979e-02 2.23541994e+02
1716.lowfreq: -10.2093 0.0016 0.0017 0.0023 3.6048 7.2182 7.9426 8.1985 9.4449
frequency: -5.8922 7.9409 9.3192 10.1099 16.0876 16.1943 25.9088 33.3161 76.8202 78.5972 93.6778 99.4495 100.6922 130.7438 133.8250 158.4278 163.3017 205.4260 214.2532 217.9177 218.8412 223.0092 223.8416 225.3951 236.1301 247.5701 254.4779 287.8361 294.5008 303.9986 304.6836 326.9520 350.6376 351.7197 373.1162 375.1680 388.0306 397.3662 397.8746 401.1412 422.4162 426.3432 428.9774 431.8040 456.2101 495.3262 520.3307 521.0896 529.7873 541.3831 549.9967 614.9491 621.1390 648.4782 664.5563 665.1396 674.9263 675.0207 724.9596 724.9630 756.0768 756.1528 769.4427 783.9404 785.1942 791.3356 816.0945 829.8233 830.1829 848.5352 848.6165 877.4422 921.8083 922.3626 931.5296 931.5811 980.0167 989.1721 989.3238 999.7844 1002.4218 1002.6262 1006.0717 1042.7018 1042.7162 1056.8270 1057.2755 1078.8870 1079.5368 1083.1344 1107.2278 1118.4156 1151.9525 1152.4277 1191.7177 1196.5249 1196.8397 1208.4034 1208.5139 1250.2015 1251.9299 1261.5736 1261.6184 1302.2689 1312.2588 1329.1063 1339.9372 1350.6975 1350.7822 1371.9690 1374.3227 1374.4147 1400.6654 1400.7155 1406.8503 1406.8602 1423.2974 1424.3475 1435.6285 1437.4346 1453.5125 1453.5260 1461.5142 1461.7192 1468.9617 1469.0270 1580.1650 1580.1967 1597.7313 1597.7537 2991.5451 2995.3724 2996.7639 2999.0819 2999.1201 3000.8079 3068.4787 3072.4591 3073.2010 3076.6402 3084.1912 3084.2778 3101.4615 3101.4734 3147.2789 3147.2910 3165.7845 3165.8026 3177.1136 3177.1806
redmass: 5.2885 9.2123 11.0855 11.2284 6.7118 7.5157 5.1403 6.7038 5.0479 7.7211 5.3171 8.7522 8.6959 4.3799 4.9914 6.4255 6.0630 8.5243 7.9592 8.7721 4.9093 1.3453 1.2170 3.0252 5.3876 5.0514 6.7640 4.1986 5.4364 4.9234 3.4790 4.0579 3.6232 3.2118 4.7442 4.6868 5.5499 5.3312 6.5247 6.4076 2.8949 4.3619 3.3423 4.3182 7.2606 3.7433 4.5166 4.4945 5.2654 4.6816 6.3520 5.7705 7.3862 2.2623 8.0112 7.1372 4.7083 4.7132 4.8021 4.8041 6.7988 6.8455 5.4743 6.9880 13.4707 1.9025 3.6077 7.2872 7.3222 1.2757 1.2751 3.3409 16.5171 16.0645 1.4671 1.4683 1.9129 1.3449 1.3460 2.7193 1.4759 1.5195 2.3526 1.5811 1.5808 3.2141 3.2903 2.6624 2.9484 2.3744 3.6958 5.9906 1.2926 1.2933 1.2202 5.5700 6.0325 4.1018 4.1798 1.2229 1.1497 1.3600 1.3598 1.1042 1.2089 1.3307 1.2464 3.8004 3.7993 1.2681 4.9933 5.2320 5.0772 5.0643 1.3063 1.3066 1.0719 1.0763 1.0720 1.0804 1.0487 1.0487 2.5962 2.5925 1.1720 1.1709 8.4038 8.4037 6.8871 6.8859 1.0648 1.0658 1.0595 1.0366 1.0366 1.0612 1.0984 1.0968 1.1034 1.1023 1.0958 1.0958 1.1016 1.1016 1.0888 1.0888 1.0968 1.0968 1.0924 1.0924
irintensity: 0.0286 0.0005 0.1449 0.0551 0.6393 0.9675 2.3598 0.0010 2.0770 4.0209 1.8596 0.0689 2.6766 0.0465 0.3790 0.0002 11.0723 3.3425 0.0185 11.1112 1.5068 14.2071 2.7891 23.6098 0.8974 0.0365 68.9239 2.7656 1.9747 3.4961 0.3855 6.5484 1.6406 0.1039 2.5266 4.0030 2.0867 0.2129 19.1432 41.7643 1.0825 1.0262 2.8325 0.0001 232.0513 21.2808 0.7889 5.8079 5.4068 93.2879 0.7207 4.2670 0.2638 325.7658 10.7429 13.7256 5.0267 1.1122 2.3112 7.0731 7.3802 23.7680 2.1374 88.5321 6.4117 16.5738 58.6263 1.8793 51.1363 33.9470 7.2487 0.3093 14.9084 114.9691 18.4040 4.4046 0.8016 0.2022 0.1367 0.0005 1.2509 0.9344 20.7762 5.3852 13.9460 98.2596 0.1609 2.4946 39.5710 0.9037 0.3231 9.2485 30.8119 17.4274 22.4737 225.2682 145.7829 64.2280 36.3043 50.0127 21.4177 21.2260 4.4995 0.9173 0.0377 1.8060 1.9901 14.0446 16.1759 29.7657 141.7860 35.4810 37.1362 50.7360 20.9716 0.6046 51.3383 11.7357 13.3641 28.0067 12.4190 15.9297 74.1588 38.6184 11.0518 11.1931 4.3820 6.5694 15.7962 3.6457 3.2947 0.9653 23.3019 7.9590 8.4124 21.1125 16.6458 1.6076 1.3812 1.2755 4.2301 4.2920 9.7733 39.7180 4.9324 8.3217 17.3129 1.7983 11.6549 16.0113
temp: 298.150 k
press: 1.00000 atm
elementType: 16 16 8 8 8 8 8 8 8 8 7 7 7 7 6 6 6 6 6 6 6 6 6 6 6 6 6 6 6 6 6 6 1 1 1 1 1 1 1 1 1 1 1 1 1 1 1 1 1 1 1 1
symmnumber: 1
zpe: 974185.2 jmol-1
zpe.correction: 0.371048 hartree
zpe.thermalcorrener: 0.402288 hartree
zpe.thermalcorrenthalpy: 0.403232 hartree
zpe.thermalcorrgfe: 0.302329 hartree
zpe.sumelectzpe: -2311.946192 hartree
zpe.sumelectthermal: -2311.914952 hartree
zpe.sumelectthermalent: -2311.914008 hartree
zpe.sumelectthermalfe: -2312.014911 hartree
dipole: 0.0003 9.5788 -0.0038
dipole: 9.5788
quadrupole: -204.5463 -198.3759 -226.6591
quadrupole: 0.0178 18.7532 -0.0128
quadrupole: 5.3142 11.4845 -16.7987 0.0178 18.7532 -0.0128
hfenergy: -2312.31724 hartree
pointgroup: C01 [X(C18H20N4O8S2)]
dipole: 0.0003928 3.7685958 -0.0010289 debye
polarizability: 482.6884625|-0.0366626|289.4024919|-48.3692277|-0.0001518|230.1611521 unknown
InChI: InChI=1S/C18H20N4O8S2/c1-13-3-5-15(11-17(13)21(23)24)31(27,28)19-7-9-20(10-8-19)32(29,30)16-6-4-14(2)18(12-16)22(25)26/h3-6,11-12H,7-10H2,1-2H3
charge 0 multiplicity 1
52 atoms
S  2.531803 -0.396849 1.195264
S  -2.531952 -0.397095 -1.19561
O  2.721138 -1.961648 1.615597
O  2.032599 0.731901 2.278495
O  -2.721522 -1.961991 -1.615457
O  -2.032578 0.731222 -2.279218
O  6.384582 -2.144208 -1.972787
O  -6.385822 -2.142867 1.972995
O  8.126091 -0.684416 -2.031173
O  -8.125224 -0.6806 2.033232
N  1.439271 -0.398103 -0.411338
N  -1.439443 -0.39808 0.410983
N  6.942994 -1.027543 -1.647795
N  -6.943018 -1.025414 1.648626
C  0.622892 -1.647697 -0.458217
C  0.615319 0.84561 -0.472472
C  -0.623034 -1.647646 0.458058
C  -0.615529 0.845663 0.471942
C  4.165861 0.246951 0.504952
C  -4.165876 0.247221 -0.505452
C  4.930714 -0.587655 -0.310067
C  -4.930672 -0.586859 0.310166
C  4.574809 1.535584 0.881922
C  -4.574787 1.535668 -0.883127
C  6.16958 -0.09119 -0.778319
C  -6.169394 -0.089965 0.778368
C  5.814459 1.997757 0.39615
C  -5.814356 1.998202 -0.397475
C  6.651598 1.212894 -0.444418
C  -6.651371 1.213892 0.443733
C  7.963542 1.809288 -0.909204
C  -7.96331 1.810375 0.90841
H  1.276433 -2.498503 -0.199234
H  0.321516 -1.758617 -1.518791
H  0.275293 0.924265 -1.52351
H  1.257093 1.716702 -0.252613
H  -0.321648 -1.758401 1.518647
H  -1.276563 -2.498501 0.199205
H  -1.257331 1.716704 0.251952
H  -0.27551 0.924496 1.522969
H  4.61274 -1.597265 -0.584324
H  -4.612768 -1.596341 0.584949
H  3.948526 2.138832 1.547369
H  -3.948554 2.138481 -1.549016
H  6.155495 2.999631 0.676228
H  -6.155409 2.999901 -0.678156
H  8.824673 1.216397 -0.556294
H  8.043162 1.816951 -2.009795
H  8.061758 2.841973 -0.535295
H  -8.062142 2.842558 0.533298
H  -8.824406 1.216701 0.556714
H  -8.042322 1.819333 2.009041
