program: Gaussian 09
title: 000258181
version: EM64L-G09RevD.01
frameworkgroup: C1[X(C6H7N3O)]
method: RPBEPBE
basis: SDD
operation: Freq
keyword: #pfreq=noraman
keyword: PBEPBE/SDD
title: #p freq=noraman PBEPBE/SDD
converged: YES YES NO NO
title: Mulliken charges:
elementType: O N N N C C C C C C H H H H H H H
charge: -0.224001 -0.054825 -0.629135 -0.036300 -0.448458 0.197496 -0.028521 -0.674018 0.267712 -0.242806 0.228331 0.237685 0.230231 0.226317 0.238940 0.360449 0.350902
chargesum: 0.00000
title: Mulliken charges with hydrogens summed into heavy atoms:
elementType: O N N N C C C C C C
charge: -0.224001 -0.054825 0.082216 -0.036300 0.017558 0.197496 -0.028521 0.021471 0.267712 -0.242806
polarizability: 1.04291324e+02 -2.57630780e+00 1.03206221e+02 5.23976967e+00 -3.09914494e-01 4.87998429e+01
1716.lowfreq: -12.5265 -5.8853 -3.9751 -0.0008 -0.0003 0.0003 52.4427 102.6580 118.6062
frequency: 52.3121 102.6497 118.5997 167.8809 195.4177 248.8078 281.1131 375.4323 383.7174 400.9200 481.4718 514.9946 534.9988 554.2073 606.9681 630.0945 726.7511 747.1177 762.6939 797.1284 952.6757 969.0589 1050.7203 1071.6507 1087.9398 1220.0488 1242.9930 1313.5325 1340.3302 1391.3584 1430.5821 1463.7134 1477.0675 1487.3704 1488.4056 1600.4849 1655.0239 2169.2374 2991.5777 3003.2404 3064.5860 3091.5201 3098.1875 3553.6756 3697.1045
redmass: 2.5732 4.8379 4.2433 5.6870 1.4225 2.8947 2.3816 4.3250 1.1244 4.8931 1.2535 6.4447 6.9409 5.6579 8.3034 5.9047 5.9125 6.7233 5.6217 1.3781 3.0047 2.0858 2.7731 1.6393 2.2537 3.5418 1.3594 1.3895 4.2195 1.2801 5.3672 1.0910 1.0681 1.1416 3.9833 1.4765 3.4281 12.5825 1.0349 1.0617 1.1001 1.1000 1.1019 1.0452 1.1053
irintensity: 1.1060 7.7700 9.1493 2.9036 3.9143 1.9303 5.7508 0.3264 0.1986 1.0561 324.7355 9.4206 4.9597 5.6908 4.2848 3.2789 3.3549 5.5579 16.3559 3.6919 3.2319 14.4339 12.1035 3.8844 6.4922 16.6081 0.8428 1.1725 1.0202 9.7753 20.0934 12.6089 24.5222 32.0839 53.1349 29.7082 457.0098 97.2840 24.6624 15.4146 1.2638 35.8135 30.0396 141.4575 64.5069
temp: 298.150 k
press: 1.00000 atm
elementType: 8 7 7 7 6 6 6 6 6 6 1 1 1 1 1 1 1
symmnumber: 1
zpe: 332534.1 jmol-1
zpe.correction: 0.126656 hartree
zpe.thermalcorrener: 0.136595 hartree
zpe.thermalcorrenthalpy: 0.137539 hartree
zpe.thermalcorrgfe: 0.091236 hartree
zpe.sumelectzpe: -471.535188 hartree
zpe.sumelectthermal: -471.525249 hartree
zpe.sumelectthermalent: -471.524305 hartree
zpe.sumelectthermalfe: -471.570608 hartree
dipole: 2.3275 -0.3324 0.5766
dipole: 2.4208
quadrupole: -37.6844 -78.1206 -59.0805
quadrupole: 4.7435 2.6918 0.7956
quadrupole: 20.6107 -19.8254 -0.7854 4.7435 2.6918 0.7956
hfenergy: -471.6618437 hartree
pointgroup: C01 [X(C6H7N3O1)]
dipole: 0.8753101 0.3151335 -0.2040639 debye
dipolederiv: -0.7129932 -0.1073583 0.0476602 0.2445247 -0.5094097 -0.093606 0.1483837 -0.0281867 -0.1639636 0.2224118 0.0514512 -0.0631761 0.1335826 -0.3869668 -0.0493335 -0.0646612 -0.036156 -0.1890118 -1.494585 -0.102629 0.1237085 0.219607 -0.2075519 0.0262138 0.1856067 0.0851741 -0.6940725 -0.2473868 0.0192364 -0.0043017 -0.0546166 -0.6027326 -0.0265143 -0.0156231 -0.0443977 -0.2585915 0.0463394 -0.0445575 -0.0187289 -0.0965881 0.0852197 -0.0298704 -0.0753626 -0.0305593 0.0859547 0.5867272 -0.2400137 -0.0863681 -0.2804771 0.3942114 0.0923183 -0.1482481 0.0831649 0.0435359 -0.6343389 -0.0042675 0.0847785 -0.2783552 -0.6175173 -0.0176668 0.0699029 -0.0768462 -0.0832696 -0.0066677 -0.0071631 -0.0117758 -0.0132009 0.0618139 -0.0240199 0.0689458 -0.0180103 0.0144041 1.7364275 0.3761534 -0.2093368 -0.0238802 0.5927258 0.0389365 -0.2829732 -0.0235886 0.3003268 -0.0741833 0.0102637 0.0332745 0.1083664 0.8168533 0.0659313 0.0496953 0.0954948 0.0552955 0.025657 0.0010415 -0.0296318 -0.0330815 -0.0015021 0.1235283 -0.0141901 0.0817262 -0.0198439 0.025565 0.0398051 0.0233074 0.0890315 -0.0288882 -0.0968058 0.0207217 -0.0609326 0.047993 0.106677 -0.0291725 0.0010898 0.0156128 -0.0331312 0.1261581 -0.0275384 0.082054 -0.0383872 -0.1851625 -0.0671725 0.0147417 -0.0838761 0.0883241 -0.0013387 0.0150116 0.0025904 0.0698763 0.0574635 0.1022219 0.043342 0.078172 -0.0435749 -0.0817058 0.0263192 -0.0533059 0.0397044 0.2497424 -0.0233919 0.0260688 -0.1044965 0.1760091 -0.012563 0.0144206 -0.0266181 0.395026 0.2983066 0.0255529 0.0253477 0.0796751 0.2161173 -0.0396621 0.0295892 -0.0316029 0.3950234 unknown
polarizability: 103.1034859|3.5940162|103.0836788|-6.1371553|7.390359|50.1102233 unknown
InChI: InChI=1S/C6H7N3O/c1-2-5-4(3-7)6(8)10-9-5/h2,8H2,1H3
charge 0 multiplicity 1
17 atoms
O  1.047795 1.894442 0.177999
N  -0.437884 1.890228 0.463453
N  2.752209 0.361679 -0.350689
N  0.356103 -2.863323 -0.303785
C  -2.228488 0.191435 0.557705
C  -0.789544 0.592863 0.355494
C  0.328765 -0.268799 0.024637
C  -2.900912 -0.284406 -0.756679
C  1.438869 0.591351 -0.071437
C  0.339192 -1.672983 -0.15282
H  -2.270439 -0.61951 1.30942
H  -2.776336 1.056102 0.971861
H  -2.89013 0.517625 -1.515153
H  -3.951718 -0.563248 -0.563142
H  -2.386908 -1.166623 -1.176911
H  3.07655 -0.583714 -0.540247
H  3.414077 1.13418 -0.367304
