program: Gaussian 09
title: 000258170
version: EM64L-G09RevD.01
frameworkgroup: C1[X(C9H8N4OS)]
method: RPBEPBE
basis: SDD
operation: Freq
keyword: #p
keyword: freq=noraman
keyword: PBEPBE/SDD
title: #p freq=noraman PBEPBE/SDD
converged: NO YES NO NO
title: Mulliken charges:
elementType: S O N N N N C C C C C C C C C H H H H H H H H
charge: 0.256348 -0.203623 -0.371497 -0.370643 0.007734 -0.038026 0.273011 -0.054934 -0.370501 0.379350 0.004298 -0.578388 -0.244978 -0.647536 -0.200717 0.330536 0.316927 0.299371 0.264019 0.247295 0.226302 0.239583 0.236068
chargesum: 0.00000
title: Mulliken charges with hydrogens summed into heavy atoms:
elementType: S O N N N N C C C C C C C C C
charge: 0.256348 -0.203623 -0.040961 -0.053715 0.007734 -0.038026 0.273011 -0.054934 -0.370501 0.379350 0.004298 -0.014998 0.002318 0.054417 -0.200717
polarizability: 2.09587952e+02 6.28366419e+00 1.60869895e+02 -2.59932961e+00 2.05365378e+00 7.48809099e+01
1716.lowfreq: -8.2940 -5.3477 -0.0010 0.0017 0.0026 5.9624 34.1609 52.1487 59.7365
frequency: 34.1577 52.1262 59.7334 77.0682 111.7593 126.8206 162.4801 184.3870 234.1711 250.8451 260.7561 301.3914 323.8876 412.1708 431.9145 485.9522 498.8989 530.7330 532.1452 538.6639 583.2457 591.5121 607.6398 647.7135 654.6107 688.5415 745.3611 786.3605 789.5611 877.5730 888.0671 960.2836 990.2343 1033.7785 1060.4209 1069.4217 1098.3883 1179.1086 1225.6324 1239.1424 1275.7662 1297.0389 1349.7331 1376.9377 1398.9837 1406.7860 1458.0166 1470.1563 1480.7916 1487.0462 1529.3592 1539.4086 1602.5148 1620.5089 2192.8148 2989.9453 3041.9382 3084.6544 3089.3617 3128.3072 3129.4619 3552.4205 3581.1709
redmass: 4.5196 1.8377 5.8331 7.2724 13.1170 7.1395 8.6534 7.9797 1.1086 4.3662 5.6878 6.7615 8.6525 10.1889 11.8354 4.0330 7.1901 5.0725 1.3401 7.3915 2.2547 1.7531 6.8964 7.3300 7.9668 10.7693 9.1313 7.3573 1.1658 8.3779 1.4632 8.0730 1.7614 1.2030 3.7087 2.3287 4.5113 2.5847 7.0959 1.2527 1.2405 2.2037 1.5623 2.1188 1.2121 4.1176 1.0927 1.0439 1.0668 7.3430 5.5345 4.2447 6.5733 10.7470 12.6067 1.0356 1.0580 1.0987 1.1009 1.0930 1.1098 1.0794 1.0814
irintensity: 1.4490 1.9608 3.3473 0.4825 1.5280 2.2158 1.2393 3.3647 0.4224 0.3638 4.8472 3.0729 1.7214 2.6284 0.4476 13.8524 14.9924 1.2393 23.3425 1.1690 57.3720 107.0165 0.4555 12.5259 6.3638 0.1996 16.6619 3.6054 12.1853 6.5565 12.1305 30.7225 30.1019 5.3360 33.1380 4.4943 8.4285 7.9379 23.0523 5.8355 35.0953 39.0994 1.3620 34.8490 23.7834 10.8891 8.6452 15.1868 9.7324 9.9426 179.4665 87.6877 61.0431 362.6998 29.4140 25.1451 8.1924 18.1010 12.6395 19.9748 16.5373 52.5629 74.7776
temp: 298.150 k
press: 1.00000 atm
elementType: 16 8 7 7 7 7 6 6 6 6 6 6 6 6 6 1 1 1 1 1 1 1 1
symmnumber: 1
zpe: 427125.3 jmol-1
zpe.correction: 0.162683 hartree
zpe.thermalcorrener: 0.176913 hartree
zpe.thermalcorrenthalpy: 0.177857 hartree
zpe.thermalcorrgfe: 0.120161 hartree
zpe.sumelectzpe: -1038.962346 hartree
zpe.sumelectthermal: -1038.948116 hartree
zpe.sumelectthermalent: -1038.947172 hartree
zpe.sumelectthermalfe: -1039.004869 hartree
dipole: 2.5256 -11.9547 1.4375
dipole: 12.3029
quadrupole: -92.8739 -97.6662 -94.7635
quadrupole: 20.4213 6.6280 0.3076
quadrupole: 2.2273 -2.5650 0.3377 20.4213 6.6280 0.3076
hfenergy: -1039.1250291 hartree
pointgroup: C01 [X(C9H8N4O1S1)]
dipole: -1.2363359 4.5612557 -1.0465109 debye
dipolederiv: -0.2893508 -0.056986 0.1219834 -0.2009348 -0.0809932 -0.0033348 0.1425648 -0.0115364 -0.0085105 -0.4979067 0.0391073 -0.0345229 0.3398613 -0.9863753 0.2681098 -0.1552592 0.238566 -0.4414271 -0.5578715 -0.1329388 0.0035945 0.1066013 -0.5378076 0.1122828 0.0020024 0.0912302 -0.2432448 -0.9934205 -0.0567152 -0.0940286 0.0543065 -0.6253759 0.1591393 -0.1524929 0.1483895 -0.2868576 -0.438707 -0.2963965 0.0777105 0.1598235 -0.9105517 0.2499093 -0.0926103 0.1748097 -0.3446383 -0.2640434 -0.0946231 0.0296214 -0.0264854 -0.3605967 0.0149892 0.020546 0.0166678 -0.239791 0.612363 0.2338125 0.0227956 0.0120985 0.453101 -0.1481409 0.0746781 -0.1143507 0.1601571 -0.3511132 0.3510245 -0.1249421 0.2782485 -0.3268158 0.1510046 -0.1540026 0.1572533 -0.1403282 0.4673302 0.0782457 0.0181007 0.047835 0.4347488 -0.120038 0.0584318 -0.1494079 -0.1258837 0.0012974 -0.0086709 -0.003778 0.0133317 -0.1637813 0.0790321 -0.1319366 0.1222477 0.0343058 0.91393 0.0784372 0.0668242 -0.362884 1.4161285 -0.449352 0.26795 -0.3948899 0.4283983 0.2469 0.0656188 -0.2560189 0.25875 0.05962 0.009318 -0.4272068 0.0417523 0.276069 0.7349833 -0.2459949 0.2161619 -0.5396995 0.7492712 -0.3470226 0.3320755 -0.3123894 0.1598794 -0.1349884 -0.0074138 0.012759 -0.0711744 0.0812642 0.0095596 0.2709401 -0.0199756 -0.0167579 0.0472203 0.1531011 -0.0473706 0.0455938 0.3815921 -0.0748071 -0.0181584 -0.0826853 0.0621261 0.2108379 -0.0258249 -0.0266041 -0.0101808 0.2405265 0.0085161 -0.0124284 0.0112629 0.3147024 0.1479039 0.0328661 -0.0498236 0.0275255 0.2117888 0.0535993 -0.0429935 0.0534688 0.3289716 0.0406937 0.0436393 0.0152458 0.0325781 -0.0194898 0.054374 0.0299586 0.0467933 -0.0052411 -0.0166254 -0.0635646 -0.0167792 -0.0710893 0.0070547 -0.0651871 0.0647992 -0.0698131 -0.081223 0.0165166 -0.0895073 0.0110374 -0.131853 -0.0367256 0.0392024 0.0186441 0.0434091 0.1242536 0.0683009 0.0310555 -0.0073874 0.1051543 -0.1011688 0.0517247 -0.0775497 0.0667087 0.0957608 0.0889936 -0.0210691 -0.0270838 -0.0421168 0.0020431 -0.1010349 -0.1145409 -0.1045288 0.0051551 -0.0532437 -0.0072029 0.0925049 -0.0252899 0.1125429 0.0481563 0.0965887 0.0470177 -0.0558759 unknown
polarizability: 208.5551277|10.4984994|151.0516525|3.7758607|-28.3154928|85.7319767 unknown
InChI: InChI=1S/C9H8N4OS/c1-2-15-9-5(3-10)6-7(13-9)11-4-12-8(6)14/h4,11,13H,2H2,1H3
charge 0 multiplicity 1
23 atoms
S  -2.956441 0.773708 -0.947046
O  2.325602 -1.642544 0.966387
N  -0.371773 1.800418 -0.753777
N  2.071423 2.240093 -0.471012
N  3.371254 0.406354 0.422421
N  -1.3507 -2.721523 0.597026
C  0.924009 1.464814 -0.400819
C  0.952008 0.138912 0.072009
C  -1.207993 0.686723 -0.52701
C  -0.407465 -0.357423 -0.022012
C  2.213731 -0.469389 0.523561
C  -3.764703 0.353208 0.750964
C  3.263633 1.63201 -0.035254
C  -5.285866 0.401836 0.576819
C  -0.891807 -1.653003 0.318136
H  -0.717236 2.695484 -1.100118
H  2.074291 3.202337 -0.812456
H  -3.413175 -0.651864 1.029759
H  -3.397217 1.097992 1.474584
H  4.152446 2.271568 -0.09884
H  -5.63383 1.405438 0.274328
H  -5.627857 -0.330355 -0.175533
H  -5.770734 0.148107 1.537184
