program: Gaussian 09
title: 000258156
version: EM64L-G09RevD.01
frameworkgroup: C1[X(C13H9NO4)]
method: RPBEPBE
basis: SDD
operation: Freq
keyword: #p
keyword: freq=noraman
keyword: PBEPBE/SDD
title: #p freq=noraman PBEPBE/SDD
converged: YES YES NO NO
title: Mulliken charges:
elementType: O O O O N C C C C C C C C C C C C C H H H H H H H H H
charge: -0.437247 -0.227039 -0.210085 -0.211029 0.024909 0.269063 0.357198 0.076155 -0.339881 -0.370932 -0.377020 -0.325342 0.376216 -0.354580 -0.363620 -0.224733 -0.226011 0.077713 0.251035 0.255944 0.257503 0.282009 0.285431 0.285041 0.239297 0.241639 0.388367
chargesum: 0.00000
title: Mulliken charges with hydrogens summed into heavy atoms:
elementType: O O O O N C C C C C C C C C C C C C
charge: -0.048880 -0.227039 -0.210085 -0.211029 0.024909 0.269063 0.357198 0.076155 -0.088847 -0.114988 -0.119517 -0.043334 0.376216 -0.069150 -0.078579 0.014564 0.015628 0.077713
polarizability: 2.67825733e+02 -1.39080352e+01 1.56687666e+02 9.85077865e+00 1.47538584e+01 9.52071946e+01
1716.lowfreq: -9.9485 -4.2860 -0.0008 -0.0006 -0.0004 4.0871 32.2871 39.3553 47.4358
frequency: 32.2703 39.3546 47.4356 70.6312 88.2319 129.5879 145.4737 198.4919 225.0072 240.4318 308.3425 331.1984 385.4824 408.4727 411.7921 445.9186 493.9566 503.5045 538.1191 549.1722 593.0766 601.7442 625.9855 637.4513 670.0939 687.1532 707.1053 736.7258 762.7231 771.2648 791.0458 799.4571 846.9925 859.7462 898.0361 975.0415 983.1393 990.6325 991.4674 998.4961 1004.6522 1013.0134 1050.9837 1093.5972 1108.4486 1117.7937 1159.8879 1180.0701 1183.5314 1222.2973 1262.5981 1288.3403 1297.8537 1308.2967 1355.1851 1372.8652 1389.4125 1413.4472 1429.2428 1466.3988 1494.4804 1572.8472 1590.2176 1602.0557 1607.5750 1641.8210 3135.2839 3147.5899 3149.8751 3151.5354 3164.6452 3183.6543 3184.1179 3186.3041 3526.4790
redmass: 7.3451 8.8790 8.7691 6.2684 5.3153 5.5431 7.2667 6.6391 6.7485 8.7868 5.0225 6.1205 7.1767 2.9239 3.4162 6.2292 6.5021 5.5240 4.2693 3.5453 1.5499 2.7948 6.4266 7.0747 4.5609 4.1519 5.5425 3.9625 5.2932 2.3727 2.1379 7.9048 1.2426 1.6033 1.4272 1.4231 1.3536 1.4658 4.4066 4.9981 1.3587 3.0452 2.2344 3.1328 1.4387 1.5450 1.7761 1.0670 1.3741 4.9868 1.7958 2.0651 1.3507 2.4089 5.5172 9.7049 9.1827 3.9242 2.2900 2.3188 2.9931 6.8689 7.8243 6.2959 6.4272 8.8221 1.0864 1.0905 1.0909 1.0905 1.0969 1.0947 1.0969 1.0960 1.0642
irintensity: 0.1954 0.3848 0.2511 0.0834 0.7756 0.3196 5.2261 2.5254 2.9900 1.2209 0.2118 2.6886 2.3845 0.2908 8.5162 9.7039 3.3221 3.3964 12.0781 9.3955 80.3263 52.2439 1.7047 0.9295 27.6585 42.9181 22.8725 23.2696 29.2502 38.2399 21.3615 12.9988 0.0834 49.3244 1.4992 19.7282 3.0529 9.2852 129.5039 139.6761 1.8421 6.5431 13.5046 18.5612 8.5759 68.0609 68.6438 0.2167 89.7233 358.1301 7.4650 2.7516 1.5688 69.4973 59.9063 20.8424 35.0991 35.2710 5.0507 30.1443 6.4621 20.5754 2.5208 6.6788 60.5002 248.6257 2.1648 7.8166 12.3477 2.4859 16.5904 0.0194 8.0500 4.5095 50.0747
temp: 298.150 k
press: 1.00000 atm
elementType: 8 8 8 8 7 6 6 6 6 6 6 6 6 6 6 6 6 6 1 1 1 1 1 1 1 1 1
symmnumber: 1
zpe: 505880.7 jmol-1
zpe.correction: 0.192680 hartree
zpe.thermalcorrener: 0.207501 hartree
zpe.thermalcorrenthalpy: 0.208445 hartree
zpe.thermalcorrgfe: 0.148822 hartree
zpe.sumelectzpe: -855.110821 hartree
zpe.sumelectthermal: -855.096000 hartree
zpe.sumelectthermalent: -855.095055 hartree
zpe.sumelectthermalfe: -855.154679 hartree
dipole: 7.4293 -1.6444 0.6092
dipole: 7.6335
quadrupole: -122.2496 -89.2471 -103.8502
quadrupole: 1.1741 0.2426 1.6706
quadrupole: -17.1340 15.8686 1.2655 1.1741 0.2426 1.6706
hfenergy: -855.3035007 hartree
pointgroup: C01 [X(C13H9N1O4)]
dipole: -2.9566101 -0.5234846 -0.0626328 debye
polarizability: 269.1410454|9.5341968|140.048166|5.4325276|-30.4462562|110.5313822 unknown
InChI: InChI=1S/C13H9NO4/c15-13(16)12-4-2-1-3-11(12)9-5-7-10(8-6-9)14(17)18/h1-8,15H
charge 0 multiplicity 1
27 atoms
O  -2.903833 2.771813 -0.82953
O  -0.831975 2.418567 0.145465
O  4.868979 0.285879 -1.13738
O  4.985898 -0.605826 0.959135
N  4.321002 -0.187994 -0.067378
C  -1.45604 -0.537345 0.117061
C  0.031924 -0.388212 0.084311
C  -2.37867 0.52557 -0.148189
C  0.691583 0.125911 -1.065421
C  0.815974 -0.847091 1.176923
C  -1.981903 -1.833275 0.362647
C  -3.772746 0.256692 -0.204129
C  2.841927 -0.258668 -0.015219
C  2.093256 0.193814 -1.124784
C  2.221139 -0.778595 1.140341
C  -3.369457 -2.087318 0.326053
C  -4.270345 -1.040411 0.02762
C  -1.922507 1.944092 -0.249806
H  0.099148 0.463739 -1.921611
H  0.317144 -1.232257 2.072484
H  -1.284057 -2.656258 0.550764
H  -4.454187 1.085582 -0.41147
H  2.614899 0.583984 -2.002279
H  2.837754 -1.11241 1.978722
H  -3.741997 -3.099763 0.515471
H  -5.347697 -1.23026 -0.014205
H  -2.56521 3.707439 -0.827595
