program: Gaussian 09
title: 000258155
version: EM64L-G09RevD.01
frameworkgroup: C1[X(C13H11NO3)]
method: RPBEPBE
basis: SDD
operation: Freq
keyword: #p
keyword: freq=noraman
keyword: PBEPBE/SDD
title: #p freq=noraman PBEPBE/SDD
converged: NO YES NO NO
title: Mulliken charges:
elementType: O O O N C C C C C C C C C C C C C H H H H H H H H H H H
charge: -0.444987 -0.203528 -0.184699 -0.001816 0.254227 0.217043 0.253500 0.198938 -0.357254 -0.345915 -0.360759 -0.528942 -0.229288 -0.363814 -0.243144 -0.245191 -0.221327 0.246783 0.302948 0.231727 0.217759 0.241757 0.234659 0.274879 0.232599 0.240760 0.242681 0.340400
chargesum: 0.00000
title: Mulliken charges with hydrogens summed into heavy atoms:
elementType: O O O N C C C C C C C C C C C C C
charge: -0.104586 -0.203528 -0.184699 -0.001816 0.254227 0.217043 0.253500 0.198938 -0.110471 -0.042967 -0.129032 -0.069425 0.005372 -0.088936 -0.010544 -0.004430 0.021354
polarizability: 2.08025006e+02 1.64905876e+01 1.72800357e+02 -9.26526020e+00 3.34581119e+00 9.54792733e+01
1716.lowfreq: -6.4681 -0.0007 -0.0004 0.0001 7.6576 9.1142 37.6182 58.1271 73.9528
frequency: 37.5398 58.1093 73.9527 93.7453 116.5190 136.2877 148.4781 191.9006 239.0130 272.1968 301.0234 320.2728 354.2362 385.4093 404.2529 413.5455 488.8822 512.8037 548.6996 570.7982 592.3035 617.1774 645.8707 672.6199 707.5539 742.0210 756.8369 770.3518 786.7613 790.5517 821.2339 884.3628 894.6889 909.5736 953.2628 959.4831 972.9638 994.1203 994.6929 1002.4800 1038.8646 1048.7641 1079.6867 1107.4683 1139.4025 1154.9641 1178.3965 1179.6259 1209.2647 1223.0876 1259.8937 1278.7212 1301.0579 1309.3350 1364.4771 1366.8012 1373.8479 1376.5838 1424.1545 1439.8752 1466.6490 1476.7266 1495.3502 1568.5511 1584.1817 1607.0611 1609.4579 2989.8562 3101.9773 3112.1889 3127.7746 3137.4427 3144.1651 3150.0754 3164.5481 3165.2705 3181.7596 3555.3985
redmass: 6.8657 10.7715 5.2751 5.1457 4.4093 5.0514 4.9844 5.8979 4.2431 4.5445 5.2734 1.4663 3.4328 4.4452 3.6391 2.6285 4.2380 4.5248 4.2513 3.9952 4.5488 6.7437 7.0899 6.1772 5.6647 2.8317 3.8158 1.6450 1.5573 4.9142 4.0249 1.4442 1.4503 3.6492 1.7081 1.4118 1.3830 2.0211 2.4402 1.3688 3.2278 2.2439 2.5688 1.5504 1.8633 1.1830 1.0735 1.0751 2.5197 10.5123 1.9339 1.5640 1.2537 1.6710 7.4078 1.4822 3.4172 5.9467 2.3938 2.3913 2.2342 1.1233 2.8349 6.0293 6.9601 6.5817 6.2434 1.0687 1.0958 1.0885 1.0880 1.0880 1.0930 1.0916 1.0953 1.1006 1.0983 1.0664
irintensity: 1.1923 0.9222 2.5925 1.7759 4.8614 4.5668 0.8867 3.0743 2.7636 1.3735 2.8291 86.0241 38.2685 9.5955 3.4756 41.1657 1.0654 6.7482 9.4891 1.5989 12.9159 4.1359 9.6119 11.6631 7.7078 44.7942 5.4555 59.4836 48.1825 27.2749 6.7461 3.4745 10.2148 66.6238 0.1821 0.2945 6.0402 2.2570 2.9403 4.7909 1.0074 1.6905 4.2212 17.0002 2.8526 18.9620 0.4328 2.3628 9.1467 194.8832 1.1469 3.7153 14.6437 1.2866 126.5315 27.6900 24.2023 1.7594 9.7381 2.2871 38.0847 16.9982 1.7719 7.6765 1.2427 9.3286 0.6814 56.8888 11.3083 13.9885 2.2689 8.8877 19.9203 0.6234 18.4636 22.4778 8.8672 5.4927
temp: 298.150 k
press: 1.00000 atm
elementType: 8 8 8 7 6 6 6 6 6 6 6 6 6 6 6 6 6 1 1 1 1 1 1 1 1 1 1 1
symmnumber: 1
zpe: 554046.1 jmol-1
zpe.correction: 0.211025 hartree
zpe.thermalcorrener: 0.225476 hartree
zpe.thermalcorrenthalpy: 0.226421 hartree
zpe.thermalcorrgfe: 0.168955 hartree
zpe.sumelectzpe: -781.110949 hartree
zpe.sumelectthermal: -781.096498 hartree
zpe.sumelectthermalent: -781.095554 hartree
zpe.sumelectthermalfe: -781.153019 hartree
dipole: -1.7876 2.9216 -1.7571
dipole: 3.8494
quadrupole: -79.3393 -105.4177 -99.8147
quadrupole: 10.0544 -1.1575 3.8848
quadrupole: 15.5179 -10.5604 -4.9575 10.0544 -1.1575 3.8848
hfenergy: -781.3219743 hartree
pointgroup: C01 [X(C13H11N1O3)]
dipole: -0.4514412 -1.400406 0.3588046 debye
polarizability: 212.4838525|-10.0584802|161.2927612|11.9434615|20.3007351|102.5280228 unknown
InChI: InChI=1S/C13H11NO3/c15-9-10-5-1-2-6-11(10)12-7-3-4-8-13(12)14(16)17/h1-8,15H,9H2
charge 0 multiplicity 1
28 atoms
O  -1.224873 -3.033453 -1.166319
O  2.001656 3.055483 0.535316
O  0.355092 2.394835 -0.899433
N  1.305543 2.144656 -0.064917
C  -0.793076 -0.019397 0.261388
C  0.677593 -0.298771 0.213571
C  -1.723886 -0.650682 -0.618316
C  1.667733 0.725673 0.189789
C  -1.282123 0.864495 1.260032
C  1.154375 -1.632801 0.328022
C  -3.104314 -0.349772 -0.489911
C  -1.299897 -1.640148 -1.688215
C  -2.658548 1.13852 1.386718
C  3.048103 0.45968 0.32613
C  -3.579654 0.531683 0.503547
C  2.53299 -1.91957 0.428351
C  3.484768 -0.873772 0.446429
H  -0.573341 1.338334 1.949141
H  0.421965 -2.447163 0.326912
H  -3.813424 -0.807516 -1.191975
H  -2.002179 -1.603503 -2.544499
H  -0.282527 -1.443847 -2.058587
H  -3.008058 1.824721 2.165427
H  3.752434 1.296055 0.316367
H  -4.650066 0.749494 0.583368
H  2.859919 -2.961858 0.505373
H  4.553109 -1.092826 0.539361
H  -2.117515 -3.280349 -0.812771
