program: Gaussian 09
title: 000258151
version: EM64L-G09RevD.01
frameworkgroup: C1[X(C5H7N5O)]
method: RPBEPBE
basis: SDD
operation: Freq
keyword: #pfreq=noraman
keyword: PBEPBE/SDD
title: #p freq=noraman PBEPBE/SDD
converged: YES YES NO NO
title: Mulliken charges:
elementType: O N N N N N C C C C C H H H H H H H
charge: -0.421327 -0.080249 -0.093474 -0.627562 -0.634382 -0.150620 0.119892 0.147499 0.164605 -0.238268 -0.359324 0.207754 0.239871 0.324701 0.380359 0.339791 0.314460 0.366275
chargesum: 0.00000
title: Mulliken charges with hydrogens summed into heavy atoms:
elementType: O N N N N N C C C C C
charge: -0.055052 -0.080249 -0.093474 0.077498 0.019868 -0.150620 0.119892 0.147499 0.164605 -0.030514 -0.119452
polarizability: 1.53195834e+02 -3.58967904e+00 1.15503299e+02 1.17703914e-02 -1.36685727e-03 3.85472879e+01
1716.lowfreq: -10.2130 -0.0007 -0.0007 -0.0007 7.4026 9.7712 53.6616 155.2041 164.5351
frequency: 53.6125 155.2038 164.5351 181.5189 208.2819 313.2602 342.2755 380.7784 381.8456 397.2713 399.0702 489.7287 529.7320 540.3933 548.7136 575.0200 592.9863 678.5477 755.0996 757.3435 795.1602 869.1030 900.0895 910.8986 948.7868 962.0990 1012.5491 1139.6727 1201.3971 1246.9239 1292.3894 1319.9860 1348.5963 1399.0307 1439.2253 1479.9755 1522.6894 1533.7398 1559.1718 1605.4045 1621.3747 3064.7805 3154.2524 3336.3918 3550.9724 3575.2933 3624.9678 3707.4485
redmass: 3.8482 3.2440 5.4682 6.5075 6.6025 4.4094 2.0638 1.3594 4.5581 4.6507 1.3356 3.3868 2.9146 7.9902 1.1750 6.1643 1.2596 7.7542 1.1001 4.8467 8.2868 8.0200 8.2272 1.5140 1.4501 2.2962 2.2484 2.7154 1.8639 1.4803 3.2097 3.8128 1.6892 2.0348 2.6131 2.7074 4.6039 6.1459 3.1539 1.9823 1.3629 1.0881 1.0920 1.0592 1.0457 1.0675 1.0929 1.1034
irintensity: 7.3286 5.7216 0.9776 0.0003 0.9687 14.8957 6.7722 41.3722 11.4532 1.8055 275.9079 0.8248 14.5769 0.8797 41.0146 2.9265 247.3818 0.1345 96.8931 48.3534 47.4421 22.5636 145.7920 19.0088 9.3076 13.9726 6.2703 16.2196 44.2457 3.8121 12.8453 67.8845 29.4664 90.2233 14.9954 7.4100 193.2747 112.0938 88.5557 530.7008 255.4049 17.7799 25.4016 83.1533 91.8430 77.1758 83.4998 31.8478
temp: 298.150 k
press: 1.00000 atm
elementType: 8 7 7 7 7 7 6 6 6 6 6 1 1 1 1 1 1 1
symmnumber: 1
zpe: 350312.0 jmol-1
zpe.correction: 0.133427 hartree
zpe.thermalcorrener: 0.143484 hartree
zpe.thermalcorrenthalpy: 0.144428 hartree
zpe.thermalcorrgfe: 0.098153 hartree
zpe.sumelectzpe: -542.878753 hartree
zpe.sumelectthermal: -542.868695 hartree
zpe.sumelectthermalent: -542.867751 hartree
zpe.sumelectthermalfe: -542.914026 hartree
dipole: 3.1444 1.2085 -0.0017
dipole: 3.3686
quadrupole: -61.6645 -51.5123 -67.8000
quadrupole: -7.0279 -0.0041 -0.0028
quadrupole: -1.3390 8.8133 -7.4744 -7.0279 -0.0041 -0.0028
hfenergy: -543.0121796 hartree
pointgroup: C01 [X(C5H7N5O1)]
dipole: -1.2693487 -0.3805345 -0.0193679 debye
dipolederiv: -1.4803289 -0.0366647 -0.0206001 -0.6884803 -0.0723669 -0.0178292 -0.0133557 -0.0051526 -0.3975499 -0.904159 0.5297019 -0.0200494 0.0949325 -0.7144344 0.0089754 -0.0136465 0.0163995 -0.2408152 -0.7570132 -0.5357173 -0.0013745 -0.1424218 -1.0294764 0.0089538 -0.0075099 0.0019123 -0.2431394 -0.5209917 0.5688127 -0.0062246 0.2298399 -0.9557459 0.0082254 -0.0011691 0.0145601 -0.6408634 -0.1251283 -0.2725705 0.0154994 0.1354758 -1.4534546 0.0144561 0.0092069 0.007972 -0.7005815 0.6183333 -0.0360415 0.0174133 0.8145588 -0.1942282 0.0154389 0.0079 -0.0011163 -0.2181255 -0.7220986 0.1216329 -0.0143812 -0.0456678 -0.7989035 0.0099943 -0.0123461 0.0132191 -0.0589274 0.7923969 -0.624944 0.0200448 -0.0849807 1.1295075 -0.0149376 0.0127246 -0.0250264 0.1847969 0.7263267 0.3190718 0.0047192 -0.2902576 1.7027524 -0.0288712 0.0140302 -0.0173176 0.1959084 0.6701596 0.0497134 0.0120667 0.1389347 0.1156901 0.0013178 0.0102898 -0.0004746 -0.0127805 0.6094919 -0.0859981 0.0132557 -0.0283848 1.111537 -0.0176354 0.013072 -0.0186237 -0.0381079 0.0405186 -0.0067413 -0.0026165 -0.052958 -0.111463 0.0028527 -0.0017994 0.0037411 0.1806558 -0.1074957 -0.0427204 -0.0035178 -0.0419028 0.0805377 -0.0002418 -0.004076 -0.0003408 0.1157424 0.178356 -0.0477677 -0.0027247 -0.019803 0.2587312 0.0013349 -0.003262 0.000938 0.3686163 0.2909434 0.0592259 -0.0019028 0.04369 0.285602 0.0020982 -0.0018219 0.0024413 0.3557706 0.19575 -0.0272154 -0.003049 -0.0393885 0.2759321 0.0007433 -0.0028515 0.0006813 0.3795619 0.1055465 0.0148856 -0.0055875 -0.0131235 0.2604579 0.0014929 -0.0050811 0.0012474 0.3738035 0.3893925 0.0533369 -0.0009709 -0.0100628 0.1093251 0.0036317 -0.0003045 0.0049398 0.396035 unknown
polarizability: 152.394383|-6.3665266|116.2431922|2.2603546|-1.2622485|38.6088459 unknown
InChI: InChI=1S/C5H7N5O/c6-4-3(1-10-11)5(7)9-2-8-4/h1-2,11H,6-7H2
charge 0 multiplicity 1
18 atoms
O  -3.843924 -0.219158 -0.01232
N  1.668071 1.493534 0.06911
N  2.192142 -0.887732 0.11417
N  -0.54314 2.246289 0.017619
N  0.572131 -2.540172 0.10944
N  -2.529614 0.430808 0.006138
C  -0.167933 -0.171623 0.059197
C  0.321429 1.18907 0.04872
C  0.848576 -1.19022 0.093566
C  -1.5804 -0.497832 0.036719
C  2.514172 0.433779 0.099915
H  -1.899089 -1.552271 0.044297
H  3.583649 0.668054 0.1172
H  -0.143813 3.18371 0.010641
H  -1.556114 2.057018 0.002161
H  1.373521 -3.168261 0.133937
H  -0.368065 -2.921475 0.096076
H  -4.4733 0.546284 -0.035385
