program: Gaussian 09
title: 000258148
version: EM64L-G09RevD.01
frameworkgroup: C1[X(C9H7ClN2O)]
method: RPBEPBE
basis: SDD
operation: Freq
keyword: #p
keyword: freq=noraman
keyword: PBEPBE/SDD
title: #p freq=noraman PBEPBE/SDD
converged: YES YES NO YES
title: Mulliken charges:
elementType: Cl O N N C C C C C C C C C H H H H H H H
charge: -0.039426 -0.228864 -0.415418 0.014221 0.417339 0.002611 0.066351 -0.360150 0.049374 -0.312956 -0.081767 -0.223246 -0.758016 0.337382 0.262753 0.269285 0.264222 0.246135 0.246122 0.244047
chargesum: 0.00000
title: Mulliken charges with hydrogens summed into heavy atoms:
elementType: Cl O N N C C C C C C C C C
charge: -0.039426 -0.228864 -0.078037 0.014221 0.417339 0.002611 0.066351 -0.097396 0.049374 -0.043671 -0.081767 0.040976 -0.021712
polarizability: 2.28817613e+02 -8.97161984e+00 1.19116350e+02 5.21451381e-03 1.02403644e-02 5.12623149e+01
1716.lowfreq: -1.0247 0.0001 0.0016 0.0023 1.8950 9.3494 70.8555 98.7989 118.7784
frequency: 70.8554 98.7952 118.7743 174.8553 190.7235 256.3102 274.5034 318.8294 350.3473 353.8268 421.3512 455.8084 469.7628 503.2296 578.4841 586.6470 604.8539 688.2429 699.7264 727.8119 744.8977 772.8507 820.2526 827.2001 857.9677 913.0944 961.9117 1001.4311 1033.4468 1066.1943 1120.2325 1152.2023 1224.7657 1249.6569 1274.3829 1290.5042 1349.6784 1392.7545 1398.0260 1437.4717 1443.5115 1457.9253 1471.1032 1546.6169 1569.9513 1612.1026 1622.6193 2991.0852 3065.6979 3130.5780 3155.8630 3166.6813 3187.4398 3503.0663
redmass: 5.0201 6.7515 1.0616 8.6353 4.9590 4.9839 3.5703 8.9487 7.4685 4.3186 4.7309 6.8949 3.1907 5.7657 5.7657 4.6727 7.3051 2.1687 6.4361 8.1454 1.9697 2.7299 3.7431 1.5504 1.5554 5.1128 1.3444 1.9361 1.5717 2.0930 1.4845 4.1778 2.3233 1.7811 2.3569 4.8027 2.1796 1.3195 5.8878 1.4279 1.0458 2.5865 2.6360 6.8555 7.3786 6.5663 5.8633 1.0378 1.0952 1.1002 1.0929 1.0890 1.0976 1.0770
irintensity: 0.0227 2.6055 1.2743 0.6229 2.5281 6.6568 5.5372 9.8258 1.1697 0.9821 2.4188 15.4293 8.7626 2.1637 19.0932 3.2481 4.6542 8.6944 6.9550 10.2161 33.6357 51.9234 0.5083 43.2743 51.6527 36.6124 1.0391 31.0627 3.8558 33.1501 17.5162 41.9206 4.0042 4.1069 23.5989 3.6822 8.7439 40.6697 16.0105 16.9629 16.0181 1.3404 42.6915 22.6261 41.9855 255.8057 302.1122 4.5613 9.4632 9.3967 1.1220 0.4946 1.5605 31.4976
temp: 298.150 k
press: 1.00000 atm
elementType: 17 8 7 7 6 6 6 6 6 6 6 6 6 1 1 1 1 1 1 1
symmnumber: 1
zpe: 375369.6 jmol-1
zpe.correction: 0.142971 hartree
zpe.thermalcorrener: 0.153839 hartree
zpe.thermalcorrenthalpy: 0.154784 hartree
zpe.thermalcorrgfe: 0.105913 hartree
zpe.sumelectzpe: -991.057123 hartree
zpe.sumelectthermal: -991.046254 hartree
zpe.sumelectthermalent: -991.045310 hartree
zpe.sumelectthermalfe: -991.094181 hartree
dipole: -1.5476 0.4234 0.0000
dipole: 1.6045
quadrupole: -92.7377 -78.5237 -83.5377
quadrupole: 5.3276 0.0006 0.0008
quadrupole: -7.8046 6.4093 1.3953 5.3276 0.0006 0.0008
hfenergy: -991.2000936 hartree
pointgroup: C01 [X(C9H7Cl1N2O1)]
dipole: 0.6180089 -0.1287023 0.0000189 debye
dipolederiv: -0.8831387 -0.1941359 0.0000523 -0.3197088 -0.1994557 0.0000307 0.000071 0.0000274 -0.0584515 -1.1664473 0.291065 -0.0000193 0.7186408 -0.7395552 0.0000378 -0.0001285 0.0000653 -0.370348 -0.9973367 0.3992555 -0.0000609 -0.1354591 -0.2738212 -0.000004 0.0000469 -0.0000098 -0.3035935 0.0691215 -0.1018969 -0.0000175 0.1779151 -0.2238246 0.0000117 -0.0000656 -0.0000037 -0.2283317 0.4866387 -0.40283 0.0000643 -0.1243673 0.2460255 -0.0000201 0.0000302 -0.0000052 0.1480345 -0.1983688 0.0784892 -0.0000103 -0.0987686 -0.0982912 0.0000207 0.0000109 0.0000171 0.026763 0.5966327 0.1799069 -0.0000205 0.736124 0.0300378 -0.0000243 -0.0000819 -0.0000059 0.0501434 -0.4653513 0.135706 -0.0000137 -0.061078 -0.0510058 -0.0000168 0.0000219 -0.0000231 -0.1663543 1.4282245 -0.461388 0.0000342 -0.8643605 0.6414912 -0.0000432 0.0001022 -0.0000629 0.2608588 0.4048709 0.0302354 -0.0000178 -0.1469114 0.141959 -0.0000329 0.0000062 -0.0000391 -0.1114563 1.2094694 0.2520929 -0.0000707 0.6447508 0.4252272 -0.0000906 -0.0001318 -0.0000798 -0.0433843 -0.5075174 -0.1582063 0.0000342 -0.4275163 -0.1794852 0.0000193 0.000076 0.0000115 -0.138016 -0.457944 -0.0997005 0.0000267 -0.0032886 0.0294445 0.0000076 0.0001049 0.0000248 0.0139597 0.1243055 -0.0229123 0.0000067 -0.0152509 0.1736459 0.000023 0.0000076 0.0000241 0.3209228 0.0775019 0.0099344 0.0000008 -0.0214349 -0.0368048 0.0000346 0.000002 0.0000348 0.1815143 0.0888955 -0.046446 0.0000088 -0.0067462 -0.0182057 0.0000267 0.0000024 0.0000286 0.1571012 0.0032111 0.0658789 -0.0000061 0.0531013 0.0584286 0.0000165 -0.0000036 0.0000147 0.1744475 0.0464966 0.0001369 -0.0631261 -0.0211274 0.0819043 0.0750229 -0.092431 0.0381321 -0.0153812 0.0464603 0.0001219 0.0631307 -0.0211674 0.0819407 -0.0749901 0.0923954 -0.0381205 -0.0154648 0.0942756 0.0446929 0.0000043 -0.0633467 -0.0896554 -0.0000295 -0.0000351 -0.0000305 0.1170364 unknown
polarizability: 229.5050242|-2.1465099|118.4289382|-0.0045726|-0.0105426|51.2623149 unknown
InChI: InChI=1S/C9H7ClN2O/c1-5-9(13)12-8-4-6(10)2-3-7(8)11-5/h2-4,12H,1H3
charge 0 multiplicity 1
20 atoms
Cl 4.429232 0.873887 -0.000191
O  -3.09917 1.720253 -0.000159
N  -0.785067 1.404687 -0.000144
N  -1.170166 -1.380908 0.000318
C  0.347583 0.585854 -0.000041
C  0.124559 -0.831945 0.000183
C  -2.222696 -0.569655 0.000242
C  1.662792 1.114388 -0.000158
C  -2.112434 0.925641 -0.000011
C  1.246141 -1.701886 0.000287
C  2.735343 0.211256 -0.000044
C  2.555713 -1.193605 0.000178
C  -3.613894 -1.137536 0.000228
H  -0.682033 2.425185 -0.00031
H  1.839348 2.194655 -0.000332
H  1.056054 -2.778882 0.000459
H  3.421725 -1.859818 0.00026
H  -4.178867 -0.782137 -0.881312
H  -4.178733 -0.782418 0.881972
H  -3.56963 -2.236615 0.000076
