program: Gaussian 09
title: 000258146
version: EM64L-G09RevD.01
frameworkgroup: C1[X(C15H12N2O3)]
method: RPBEPBE
basis: SDD
operation: Freq
keyword: #p
keyword: freq=noraman
keyword: PBEPBE/SDD
title: #p freq=noraman PBEPBE/SDD
converged: YES YES NO NO
title: Mulliken charges:
elementType: O O O N N C C C C C C C C C C C C C C C H H H H H H H H H H H H
charge: -0.243312 -0.416336 -0.233383 -0.418777 0.033224 0.224000 0.267583 -0.029192 0.444231 0.023534 -0.479765 0.038502 -0.372058 -0.463460 -0.506133 -0.358678 -0.427375 -0.261149 -0.235613 0.192347 0.249149 0.248793 0.339608 0.265739 0.246725 0.263482 0.303688 0.208676 0.247802 0.236408 0.236015 0.375723
chargesum: 0.00000
title: Mulliken charges with hydrogens summed into heavy atoms:
elementType: O O O N N C C C C C C C C C C C C C C C
charge: -0.243312 -0.040613 -0.233383 -0.079169 0.033224 0.224000 0.267583 -0.029192 0.444231 0.023534 0.018178 0.038502 -0.106319 -0.216735 0.061037 -0.150002 -0.179573 -0.024741 0.000402 0.192347
polarizability: 3.39722081e+02 -2.79674386e+00 1.83598097e+02 -1.93277437e+01 -1.31399195e+00 9.42548172e+01
1716.lowfreq: -4.6372 0.0000 0.0006 0.0007 6.6041 11.6964 26.9187 28.1849 41.4534
frequency: 26.7565 28.1536 41.3844 75.5865 93.2200 106.3714 160.6060 166.7129 186.6198 201.9413 266.0637 270.6468 337.5584 383.9195 402.1685 420.2037 425.2632 461.7952 472.9810 506.3808 516.5177 533.2521 545.4423 568.6452 575.6108 608.6070 638.4486 667.5933 675.3130 693.1015 738.4318 752.1859 756.4799 773.1130 783.2701 807.2207 812.2449 835.3857 879.2894 881.8755 882.7729 955.5972 964.6423 980.1453 995.5178 1004.5590 1033.3049 1039.5626 1078.1350 1093.7057 1134.2053 1150.6472 1181.8302 1184.5554 1227.0765 1238.3842 1241.8220 1259.9471 1268.1505 1278.4030 1301.6430 1311.5618 1332.5159 1368.6092 1404.7400 1413.3376 1429.2083 1439.4698 1448.3138 1452.6504 1460.7793 1518.7521 1531.8725 1571.7225 1606.1648 1613.6565 1631.1722 1667.5412 3003.7414 3015.9569 3059.5019 3099.2275 3116.8554 3130.7552 3141.8752 3148.4497 3167.9502 3174.3737 3512.4364 3512.5325
redmass: 7.5468 10.8342 6.2232 3.3421 3.4893 4.3317 4.8845 7.4079 4.6014 6.2925 4.3527 3.6084 5.8612 6.3318 6.5220 5.0379 3.1987 4.1750 5.4328 1.9119 6.1844 3.6988 5.2883 3.0799 4.4606 7.2994 1.3709 4.4386 6.9768 4.0670 1.7365 1.5307 2.2759 3.1658 3.1393 2.7587 2.7507 1.6621 4.1940 2.0288 3.2604 1.3736 5.4607 1.3518 1.3717 2.6132 2.8120 2.3192 2.3994 2.1730 2.4083 1.3154 1.1079 1.6780 1.9589 1.7589 1.4886 2.1926 1.5549 1.9259 2.2530 2.0180 2.0718 1.7809 3.8991 2.9094 4.2144 1.1244 1.2529 2.3018 2.5693 5.4748 6.6510 7.0898 6.2010 5.2600 6.4282 8.1451 1.0605 1.0618 1.0986 1.1007 1.0875 1.0879 1.0890 1.0939 1.1003 1.0968 1.0755 1.0645
irintensity: 0.4203 1.1037 0.3188 0.1566 0.7072 3.1008 1.8640 1.5947 0.2711 0.1464 5.7091 6.7278 3.7882 3.2707 5.0624 11.5316 12.3217 16.9955 17.9843 29.1671 25.0740 1.1980 32.5574 5.6506 3.1936 15.4701 122.2297 6.0619 1.1015 6.2231 12.4593 20.7911 9.9043 34.5974 48.9816 23.8447 15.4121 61.5494 0.7914 8.7365 7.4289 4.6244 6.8810 0.0834 0.3277 56.2148 114.0993 72.9944 107.5681 7.3906 43.0074 1.2697 0.2634 3.8583 0.2239 3.0792 6.2926 4.4987 32.9533 4.0343 118.3467 0.9905 20.1394 47.8497 3.2407 0.9711 1.7096 2.1849 55.5177 3.0323 15.4740 15.1263 35.0483 9.5407 27.4754 493.0613 24.1483 231.1949 18.8698 11.0212 5.8617 7.3339 9.3777 0.7587 3.4167 23.7357 29.8380 8.3251 28.3771 17.4684
temp: 298.150 k
press: 1.00000 atm
elementType: 8 8 8 7 7 6 6 6 6 6 6 6 6 6 6 6 6 6 6 6 1 1 1 1 1 1 1 1 1 1 1 1
symmnumber: 1
zpe: 633163.6 jmol-1
zpe.correction: 0.241159 hartree
zpe.thermalcorrener: 0.257517 hartree
zpe.thermalcorrenthalpy: 0.258461 hartree
zpe.thermalcorrgfe: 0.195328 hartree
zpe.sumelectzpe: -912.625617 hartree
zpe.sumelectthermal: -912.609259 hartree
zpe.sumelectthermalent: -912.608315 hartree
zpe.sumelectthermalfe: -912.671448 hartree
dipole: -5.4370 0.0092 1.8096
dipole: 5.7303
quadrupole: -99.2553 -111.7705 -122.0319
quadrupole: 3.1945 7.9794 0.7122
quadrupole: 11.7639 -0.7513 -11.0127 3.1945 7.9794 0.7122
hfenergy: -912.8667763 hartree
pointgroup: C01 [X(C15H12N2O3)]
dipole: -2.1477432 -0.1228915 -0.674303 debye
polarizability: 340.0693599|7.0205264|181.8558641|15.4161955|-12.8071597|95.6497711 unknown
InChI: InChI=1S/C15H12N2O3/c18-13(19)8-7-12-15(20)17-14-10-4-2-1-3-9(10)5-6-11(14)16-12/h1-6,17-18H,7-8H2
charge 0 multiplicity 1
32 atoms
O  1.810071 2.274765 0.1961
O  6.108923 0.088035 -1.611362
O  6.008403 -0.258968 0.68209
N  -0.296568 1.273816 0.083296
N  0.852569 -1.236478 0.490794
C  -1.146287 0.168357 0.113926
C  -2.576387 0.288525 -0.054588
C  -0.533528 -1.099007 0.320948
C  -3.365804 -0.923275 -0.006898
C  1.633837 -0.158893 0.457173
C  3.122074 -0.30924 0.657246
C  1.105525 1.218074 0.241078
C  -1.347253 -2.27938 0.362989
C  -2.722603 -2.195395 0.203671
C  3.920178 0.060942 -0.616535
C  -3.240219 1.539938 -0.264739
C  -4.784532 -0.83049 -0.171609
C  -4.628559 1.598583 -0.422272
C  -5.408633 0.403479 -0.375453
C  5.413404 -0.061996 -0.399864
H  3.329574 -1.350033 0.953822
H  3.456641 0.354742 1.476023
H  -0.674562 2.2152 -0.061546
H  -0.835282 -3.231983 0.525416
H  -3.342034 -3.098022 0.236421
H  3.63666 -0.575861 -1.474382
H  3.702183 1.106541 -0.906235
H  -2.673379 2.477951 -0.306133
H  -5.377976 -1.751287 -0.13453
H  -5.120737 2.563449 -0.582168
H  -6.495147 0.459167 -0.499719
H  7.08685 0.025346 -1.433761
