program: Gaussian 09
title: 000258141
version: EM64L-G09RevD.01
frameworkgroup: C1[X(C12H12N2O2)]
method: RPBEPBE
basis: SDD
operation: Freq
keyword: #p
keyword: freq=noraman
keyword: PBEPBE/SDD
title: #p freq=noraman PBEPBE/SDD
converged: YES YES NO NO
title: Mulliken charges:
elementType: O O N N C C C C C C C C C C C C H H H H H H H H H H H H
charge: -0.413031 -0.229385 -0.004486 -0.017197 -0.504934 0.097063 0.059786 -0.499270 0.067477 0.029915 -0.795822 -0.341004 -0.326735 0.191176 -0.218408 -0.220140 0.233559 0.253489 0.284349 0.256069 0.240448 0.225995 0.261018 0.261601 0.261051 0.234662 0.234746 0.378007
chargesum: 0.00000
title: Mulliken charges with hydrogens summed into heavy atoms:
elementType: O O N N C C C C C C C C C C C C
charge: -0.035024 -0.229385 -0.004486 -0.017197 -0.017886 0.097063 0.059786 0.041148 0.067477 0.029915 -0.068362 -0.079402 -0.065684 0.191176 0.016255 0.014606
polarizability: 2.28950253e+02 -2.37492664e+01 1.44054492e+02 1.45983943e+01 4.52829961e+00 8.80965869e+01
1716.lowfreq: -7.0464 0.0002 0.0006 0.0008 3.4229 5.9545 20.4928 22.3872 45.7500
frequency: 20.4821 21.9944 45.7121 78.4763 106.3227 139.4640 162.0151 179.0562 264.7776 272.7363 297.3377 324.0421 409.3213 452.8951 465.5707 482.2692 494.4686 501.7278 513.4882 553.9257 581.7279 604.3625 638.1956 672.9780 699.8341 728.8394 767.1280 777.3438 803.7020 822.8632 876.0410 888.2170 892.4828 971.4786 998.4803 999.2786 1011.2660 1013.2399 1026.6501 1040.0762 1077.2932 1109.8463 1129.7571 1155.0372 1178.2864 1230.5760 1238.9211 1241.3434 1272.8019 1291.1340 1308.5373 1331.8007 1357.5981 1368.5509 1393.3948 1414.5475 1437.0791 1443.7539 1458.5910 1467.6456 1469.7535 1475.1094 1533.2239 1550.8443 1616.8472 1667.2527 2981.0246 2996.9078 3031.2282 3052.6031 3057.2346 3096.7621 3116.1630 3134.8114 3148.4161 3162.9644 3173.0094 3512.0570
redmass: 11.1648 4.8591 5.5184 2.3104 3.5049 3.0140 1.2048 7.8254 3.3107 4.6287 2.5186 4.6010 5.0592 4.9846 4.1645 4.4615 3.7936 2.1797 2.9754 3.8545 5.1345 8.4451 1.3296 5.1271 4.8618 5.2865 1.5975 1.2955 3.2637 3.4187 4.5715 1.9189 3.4818 1.3605 1.3284 1.9077 2.8560 1.9045 2.5967 1.6258 2.4332 1.7971 1.8314 1.2115 1.5849 2.1836 2.9459 1.5094 1.2461 1.7102 1.9763 4.9213 2.6103 2.0914 1.2448 7.2991 1.1474 1.3654 2.1856 1.2655 1.0695 2.0067 6.6493 6.8352 6.5540 8.2870 1.0387 1.0625 1.0598 1.0969 1.0966 1.1033 1.0981 1.0858 1.0895 1.0957 1.1006 1.0640
irintensity: 0.9898 0.1279 0.1863 0.4417 1.3499 5.1967 0.3450 3.0159 2.3051 0.2649 0.6094 0.1153 18.9041 1.8620 7.6407 11.0208 1.1129 26.5764 12.2264 0.3034 19.7931 5.2806 124.8072 4.4036 1.8874 1.4365 15.3904 105.6216 0.6799 10.3327 2.6350 1.4525 5.7144 4.0229 0.1172 11.5266 102.7845 3.5030 86.7950 13.2628 113.2319 1.0534 7.0908 5.3348 12.4964 0.4075 8.6037 0.8820 0.6690 22.0981 33.6214 39.2942 75.4616 12.5817 28.1712 13.6005 7.4692 38.7978 0.4938 32.5794 10.6616 16.3322 10.6302 8.4940 0.7806 227.1224 17.2538 9.9667 12.0555 1.7958 16.5491 11.7287 8.9530 2.2528 6.6430 15.3270 27.1829 21.8845
temp: 298.150 k
press: 1.00000 atm
elementType: 8 8 7 7 6 6 6 6 6 6 6 6 6 6 6 6 1 1 1 1 1 1 1 1 1 1 1 1
symmnumber: 1
zpe: 569918.8 jmol-1
zpe.correction: 0.217071 hartree
zpe.thermalcorrener: 0.231388 hartree
zpe.thermalcorrenthalpy: 0.232332 hartree
zpe.thermalcorrgfe: 0.173266 hartree
zpe.sumelectzpe: -723.298313 hartree
zpe.sumelectthermal: -723.283996 hartree
zpe.sumelectthermalent: -723.283052 hartree
zpe.sumelectthermalfe: -723.342118 hartree
dipole: 0.5325 -0.2322 1.3222
dipole: 1.4442
quadrupole: -80.1768 -89.7360 -98.6834
quadrupole: -3.8330 -6.0295 -0.2026
quadrupole: 9.3552 -0.2039 -9.1513 -3.8330 -6.0295 -0.2026
hfenergy: -723.515384 hartree
pointgroup: C01 [X(C12H12N2O2)]
dipole: -0.2117038 0.059865 0.5238715 debye
polarizability: 229.3219815|-22.3700231|144.1299831|-15.4409313|-1.4318952|87.649367 unknown
InChI: InChI=1S/C12H12N2O2/c1-8-9(6-7-12(15)16)14-11-5-3-2-4-10(11)13-8/h2-5,15H,6-7H2,1H3
charge 0 multiplicity 1
28 atoms
O  4.870425 1.035617 1.381115
O  4.824644 0.356438 -0.839333
N  -0.296409 0.848892 -0.489417
N  -1.349161 -1.742946 0.142814
C  1.958464 -0.029853 -0.781899
C  0.489666 -0.248227 -0.475282
C  -0.04339 -1.566872 -0.153009
C  2.734116 0.376924 0.494722
C  -1.64256 0.684745 -0.187356
C  -2.173008 -0.623003 0.130365
C  0.835592 -2.798113 -0.144106
C  -2.513003 1.816994 -0.19372
C  -3.561172 -0.765659 0.434873
C  4.2144 0.570953 0.230435
C  -3.868489 1.652636 0.107581
C  -4.394057 0.35746 0.422898
H  2.419112 -0.929565 -1.222821
H  2.043659 0.782979 -1.522651
H  2.322647 1.31442 0.912106
H  2.630894 -0.38203 1.295155
H  1.223859 -3.024576 -1.155317
H  1.712258 -2.676396 0.518884
H  0.242812 -3.657899 0.203429
H  -2.086607 2.794648 -0.43911
H  -3.936984 -1.765911 0.671522
H  -4.539181 2.518709 0.103377
H  -5.45924 0.251558 0.655563
H  5.839414 1.150679 1.18188
