program: Gaussian 09
title: 000258163
version: EM64L-G09RevD.01
frameworkgroup: C1[X(C20H17N3O2)]
method: RPBEPBE
basis: SDD
operation: Freq
keyword: #p
keyword: freq=noraman
keyword: PBEPBE/SDD
title: #p freq=noraman PBEPBE/SDD
converged: NO YES NO NO
title: Mulliken charges:
elementType: O O N N N C C C C C C C C C C C C C C C C C C C C H H H H H H H H H H H H H H H H H
charge: -0.264815 -0.280597 -0.353086 -0.189369 -0.224067 0.191224 0.134935 0.232565 -0.467192 0.106574 0.425689 0.221008 0.292492 -0.646803 -0.356102 -0.356372 -0.601741 -0.378340 -0.378264 -0.212870 -0.212896 -0.221472 -0.221450 -0.232464 -0.236065 0.288977 0.251247 0.251349 0.286711 0.257138 0.257288 0.245953 0.269830 0.245835 0.237713 0.237706 0.236156 0.236163 0.229790 0.229791 0.236342 0.231494
chargesum: 0.00000
title: Mulliken charges with hydrogens summed into heavy atoms:
elementType: O O N N N C C C C C C C C C C C C C C C C C C C C
charge: -0.264815 -0.280597 -0.353086 -0.189369 -0.224067 0.191224 0.134935 0.232565 -0.178215 0.106574 0.425689 0.221008 0.292492 0.142503 -0.098963 -0.099085 0.159877 -0.140628 -0.140558 0.023286 0.023267 0.008318 0.008340 0.003878 -0.004571
polarizability: 3.17753853e+02 1.24564067e+01 2.29198821e+02 -5.56630485e-02 8.34179140e-03 1.74801516e+02
1716.lowfreq: -44.4342 -12.7080 -4.9377 -3.1807 0.0002 0.0004 0.0010 3.5829 34.5175
frequency: -44.4023 -7.0024 34.1228 43.4559 45.5622 71.2035 81.3240 109.5101 121.3384 142.0514 167.3022 197.4080 199.5314 229.7446 250.3419 258.7095 261.2475 306.5206 325.7686 371.6468 376.7978 383.9423 402.1843 407.8792 412.1213 445.1197 455.4725 497.1156 514.7077 550.0353 564.3195 604.3088 613.3875 631.4295 661.9484 670.7218 673.6403 700.4456 704.2966 704.8067 736.6258 745.6144 763.8285 769.9495 796.0758 847.8688 850.5115 857.4059 909.0044 928.9356 932.9287 954.5798 961.0619 977.9455 981.5283 989.4760 991.1049 998.2706 1002.3158 1020.2163 1027.4584 1042.9804 1062.1603 1075.9014 1077.0542 1083.5123 1123.6899 1131.7497 1161.3477 1172.9403 1174.1992 1180.0302 1186.9486 1192.1790 1233.9414 1238.9398 1269.6040 1299.6460 1308.2640 1309.6111 1330.9572 1367.8365 1377.0811 1402.5843 1415.9619 1428.8487 1432.6812 1437.7415 1464.0910 1474.1805 1475.2879 1477.6799 1485.8528 1493.7644 1506.6358 1556.1040 1572.2387 1582.6987 1594.5472 1601.7823 1608.0379 1620.8940 1648.7362 3004.4845 3010.2685 3096.5404 3101.3711 3123.5809 3124.3274 3129.1831 3133.7118 3137.0383 3139.6772 3141.0066 3150.5982 3150.6707 3159.1058 3165.8121 3172.6461 3239.8737
redmass: 3.9151 4.0341 5.2930 3.9847 5.3642 5.3138 4.7940 2.3658 1.3722 3.5083 8.0872 1.0940 5.1428 5.2155 5.0909 5.1166 6.2398 4.9931 2.9703 4.1052 6.1699 5.0304 2.8234 2.8541 5.8547 7.0770 7.2302 5.6764 5.2453 4.6457 4.5480 6.0777 6.6702 6.8596 5.0396 7.1239 6.1799 1.9628 10.0842 1.7787 2.9412 6.7427 3.5047 2.1890 2.4695 1.4218 1.2507 1.2389 3.4117 1.4333 1.5759 3.3371 6.1247 1.3894 1.3767 6.2174 6.1359 1.3206 1.3280 2.7121 2.0806 3.1387 2.1933 1.5711 1.5669 3.1696 1.2907 1.3075 2.3752 1.0541 1.0550 1.1355 1.1271 2.2796 3.4719 3.1467 5.1712 6.1754 1.3446 1.3662 5.4533 6.8252 9.0941 2.5822 1.2947 2.1906 1.6394 2.1950 1.9645 1.4516 1.0451 1.0766 2.6044 1.0449 3.5267 7.2637 7.3367 5.9758 6.4832 9.3319 6.2641 6.8303 10.6019 1.0333 1.0328 1.1028 1.1021 1.0999 1.0847 1.0879 1.0852 1.1022 1.0886 1.0925 1.0929 1.0969 1.0973 1.1018 1.1018 1.0989
irintensity: 0.0348 0.1109 0.0869 0.0049 0.3586 0.0663 0.1041 5.4902 2.0981 1.3530 3.7156 0.0327 1.6787 0.1016 0.9753 0.4177 0.6496 0.0779 6.2066 4.7649 0.0110 16.7578 0.0250 0.0370 20.8946 3.4538 8.7983 22.4532 1.1308 6.3272 5.6995 0.5231 0.0164 0.0432 14.4190 3.1822 1.8885 53.7515 5.0024 41.9779 56.5655 22.2043 9.7479 24.8101 18.3579 17.2765 0.3764 1.2544 4.3842 3.2706 1.5558 45.5410 20.1910 0.0303 0.2205 1.6188 4.6810 0.1471 0.1096 7.1650 4.0544 23.1111 9.1199 0.0165 19.4332 27.3529 0.2548 0.0725 15.5806 0.0041 0.0039 0.8442 5.4248 46.0933 1.5288 20.9020 26.6986 139.7187 0.0078 0.8253 42.9768 0.1652 1.3306 40.7588 64.4052 8.0839 18.5536 7.8416 93.0337 15.0490 16.6380 4.6667 71.8285 24.3867 261.5479 16.8619 34.9811 1.5470 2.9800 475.9338 38.5292 16.1133 533.3173 50.8405 36.9823 16.0006 19.6178 0.0142 2.5882 0.0464 1.0726 1.1102 2.5723 18.0278 18.1498 28.7297 18.4496 22.6553 13.6901 4.0913
temp: 298.150 k
press: 1.00000 atm
elementType: 8 8 7 7 7 6 6 6 6 6 6 6 6 6 6 6 6 6 6 6 6 6 6 6 6 1 1 1 1 1 1 1 1 1 1 1 1 1 1 1 1 1
symmnumber: 1
zpe: 855898.1 jmol-1
zpe.correction: 0.325994 hartree
zpe.thermalcorrener: 0.345583 hartree
zpe.thermalcorrenthalpy: 0.346528 hartree
zpe.thermalcorrgfe: 0.277677 hartree
zpe.sumelectzpe: -1085.328069 hartree
zpe.sumelectthermal: -1085.308481 hartree
zpe.sumelectthermalent: -1085.307536 hartree
zpe.sumelectthermalfe: -1085.376387 hartree
dipole: 6.7740 4.2722 0.0002
dipole: 8.0087
quadrupole: -149.6122 -150.5904 -132.6801
quadrupole: 0.8294 -0.0221 0.0139
quadrupole: -5.3180 -6.2962 11.6141 0.8294 -0.0221 0.0139
hfenergy: -1085.6540639 hartree
pointgroup: C01 [X(C20H17N3O2)]
dipole: 2.6429756 -1.7154214 0.0009287 debye
polarizability: 317.4141363|-13.6061311|229.538503|0.0925691|-0.0071189|174.8015514 unknown
InChI: InChI=1S/C20H17N3O2/c1-21-18-16(19(24)22(2)20(21)25)13-17(14-9-5-3-6-10-14)23(18)15-11-7-4-8-12-15/h3-13H,1-2H3
charge 0 multiplicity 1
42 atoms
O  -3.439447 2.964844 -0.002915
O  -4.573068 -1.594011 0.000824
N  0.064324 -0.15792 0.000748
N  -2.285322 -1.060974 0.000609
N  -3.982566 0.666168 -0.001731
C  -1.327298 -0.04791 -0.000072
C  -1.662093 1.321732 -0.001181
C  0.618867 1.172148 0.000012
C  -0.437554 2.074956 -0.001074
C  -3.038746 1.76311 -0.002073
C  0.885187 -1.351995 0.000332
C  -3.66785 -0.706381 -0.00032
C  2.087602 1.409396 0.000209
C  -1.969574 -2.505026 0.002989
C  1.301786 -1.91615 1.227143
C  1.296289 -1.918941 -1.227064
C  -5.426632 0.992237 -0.002311
C  2.798799 1.542624 1.221909
C  2.79895 1.543178 -1.221342
C  2.120938 -3.066865 1.224236
C  2.115373 -3.069707 -1.225225
C  4.187573 1.801351 1.223172
C  4.187731 1.801906 -1.222301
C  2.526651 -3.646258 -0.000749
C  4.886275 1.929931 0.000508
H  -0.359012 3.159299 -0.001729
H  -1.393914 -2.782887 0.901164
H  -1.395602 -2.786351 -0.895199
H  -2.933059 -3.036102 0.004805
H  0.984185 -1.454082 2.167989
H  0.974649 -1.458908 -2.167544
H  -5.913031 0.561528 -0.892838
H  -5.507761 2.08897 -0.007771
H  -5.911952 0.57136 0.893592
H  2.254256 1.456728 2.169247
H  2.254541 1.457541 -2.16878
H  2.443499 -3.506638 2.173926
H  2.43363 -3.51167 -2.17535
H  4.720922 1.908038 2.174278
H  4.721211 1.908992 -2.173287
H  3.162955 -4.537809 -0.00116
H  5.96289 2.134045 0.000623
