program: Gaussian 09
title: 000258127
version: EM64L-G09RevD.01
frameworkgroup: C1[X(C10H11N5O3)]
method: RPBEPBE
basis: SDD
operation: Freq
keyword: #p
keyword: freq=noraman
keyword: PBEPBE/SDD
title: #p freq=noraman PBEPBE/SDD
converged: YES YES NO NO
title: Mulliken charges:
elementType: O O O N N N N N C C C C C C C C C C H H H H H H H H H H H
charge: -0.219996 -0.245829 -0.209868 -0.178468 0.075375 -0.080379 -0.048679 -0.319491 0.203045 0.029126 0.139099 -0.079007 -0.618883 -0.354436 0.004324 0.166533 -0.603492 -0.493158 0.251466 0.250719 0.275032 0.272247 0.339031 0.249408 0.249372 0.218986 0.248746 0.235666 0.243510
chargesum: 0.00000
title: Mulliken charges with hydrogens summed into heavy atoms:
elementType: O O O N N N N N C C C C C C C C C C
charge: -0.219996 -0.245829 -0.209868 -0.178468 0.075375 -0.080379 -0.048679 0.019540 0.203045 0.029126 0.139099 -0.079007 0.158333 -0.082188 0.004324 0.166533 0.114274 0.234765
polarizability: 2.88579326e+02 -1.64669037e+01 1.51558816e+02 6.10368420e+00 2.05119677e+00 8.49528779e+01
1716.lowfreq: -8.2063 -5.2647 -0.0008 -0.0005 0.0001 5.8551 25.3776 37.0697 43.3977
frequency: 25.3143 37.0558 43.3372 75.8576 81.3729 97.3869 105.9507 110.1158 147.1033 162.8304 176.6040 209.5873 230.6036 255.9926 291.1896 303.4671 306.4367 367.0781 425.3763 441.3351 465.5972 487.9590 509.5809 523.1385 573.4304 574.7145 590.1696 671.1920 704.9978 718.0450 735.0537 770.5808 801.5713 813.8537 820.6777 877.0690 938.7363 944.3897 973.7174 1063.6218 1091.3602 1109.0645 1113.8156 1123.5215 1124.4543 1137.0782 1150.8348 1210.8313 1225.3017 1261.4289 1284.0493 1300.8333 1353.6837 1389.0449 1417.1663 1422.4204 1434.5707 1453.0538 1456.9893 1459.0254 1461.2924 1467.8056 1475.1699 1485.5632 1492.3510 1519.6439 1554.0885 1571.1478 1606.2933 1642.4029 2990.0021 3007.0607 3014.8161 3068.6625 3107.9611 3111.1247 3113.9449 3141.0762 3152.9165 3154.5750 3574.5397
redmass: 5.8488 2.9085 1.1760 3.3579 4.2950 1.1657 6.8265 1.0376 3.3796 4.4352 4.1996 5.4973 5.9529 4.8762 6.3506 5.0673 5.3102 4.9804 9.7066 5.6816 5.5019 5.2782 6.9412 8.1395 1.1521 5.2757 8.3154 8.3382 9.3777 6.6766 9.6720 10.9356 8.8975 8.3893 5.8588 7.9317 5.7864 1.4734 3.0109 4.7480 3.0002 1.2730 4.8594 1.2951 1.3139 2.3006 1.5233 2.4666 4.0083 9.1101 3.5711 1.9042 7.1211 1.9955 1.4208 1.4096 1.3815 1.0503 1.0532 1.4218 1.0530 1.8867 1.0481 1.2384 1.9224 8.1264 6.8158 5.0963 10.0162 10.8597 1.0346 1.0293 1.0326 1.1010 1.1017 1.1049 1.1009 1.1026 1.0937 1.1049 1.0775
irintensity: 2.0088 1.7418 0.7540 2.5766 1.2213 0.0306 1.8396 0.0442 0.2208 7.0762 1.5624 3.7107 3.1422 0.5836 9.7801 13.8752 2.1857 4.4042 4.8617 5.7121 26.8933 2.9302 7.7921 9.4196 105.6810 2.6933 22.6504 5.7812 1.3772 23.8330 6.2823 4.1836 7.7446 17.7518 5.1882 4.8823 10.8717 11.9870 34.1633 117.6742 33.2098 3.8207 202.9282 0.8798 0.9092 4.7123 58.8753 15.5983 7.1911 94.3543 20.1295 36.9602 5.2663 20.8691 7.8955 57.0967 26.7255 13.7932 13.1067 16.7561 11.3808 65.5500 22.5594 19.9995 51.9418 252.3329 702.2172 765.7364 103.2696 164.2034 57.9511 37.8760 15.8395 26.7892 13.3198 20.6561 25.5290 1.0455 4.3572 14.7309 141.8533
temp: 298.150 k
press: 1.00000 atm
elementType: 8 8 8 7 7 7 7 7 6 6 6 6 6 6 6 6 6 6 1 1 1 1 1 1 1 1 1 1 1
symmnumber: 1
zpe: 560349.1 jmol-1
zpe.correction: 0.213426 hartree
zpe.thermalcorrener: 0.230878 hartree
zpe.thermalcorrenthalpy: 0.231823 hartree
zpe.thermalcorrgfe: 0.166190 hartree
zpe.sumelectzpe: -885.795036 hartree
zpe.sumelectthermal: -885.777583 hartree
zpe.sumelectthermalent: -885.776639 hartree
zpe.sumelectthermalfe: -885.842271 hartree
dipole: 5.5177 1.4683 2.0511
dipole: 6.0670
quadrupole: -74.2909 -107.7049 -106.9143
quadrupole: 5.0038 -8.6577 -2.2503
quadrupole: 22.0124 -11.4015 -10.6109 5.0038 -8.6577 -2.2503
hfenergy: -886.0084612 hartree
pointgroup: C01 [X(C10H11N5O3)]
dipole: 2.1741408 -0.5333426 -0.8283046 debye
polarizability: 289.4376434|13.305856|149.3506292|0.0437182|10.2058004|86.3027476 unknown
InChI: InChI=1S/C10H11N5O3/c1-11-10-12-4-5-7(14-10)15(2)8(16)6(13-5)9(17)18-3/h4,11H,1-3H3
charge 0 multiplicity 1
29 atoms
O  -2.050554 -2.091755 0.005116
O  -3.757336 0.298141 -0.961667
O  -3.730405 1.040706 1.250544
N  0.172844 -1.314906 -0.071017
N  -0.828598 1.337365 0.248841
N  2.398711 -0.501148 -0.073315
N  2.818679 1.922348 0.189779
N  4.568053 0.401626 -0.05429
C  1.064149 -0.249503 0.008635
C  0.531906 1.07593 0.17961
C  -1.248361 -1.115462 0.020236
C  -1.660472 0.30626 0.156274
C  0.685127 -2.694208 -0.228235
C  1.489383 2.128568 0.26393
C  3.217777 0.595036 0.020694
C  -3.14106 0.5883 0.246468
C  5.192632 -0.911487 -0.230111
C  -5.230611 0.47925 -0.992192
H  1.358363 -2.942187 0.608079
H  1.25431 -2.778597 -1.168147
H  -0.184861 -3.366557 -0.238478
H  1.137655 3.157185 0.395876
H  5.1337 1.247862 0.023582
H  4.85511 -1.388031 -1.167807
H  4.930864 -1.589832 0.60168
H  6.286545 -0.784913 -0.262373
H  -5.704948 -0.190969 -0.256339
H  -5.521945 0.214393 -2.017573
H  -5.489852 1.525285 -0.757901
