program: Gaussian 09
title: 000258114
version: EM64L-G09RevD.01
frameworkgroup: C1[X(C11H10N2O2)]
method: RPBEPBE
basis: SDD
operation: Freq
keyword: #p
keyword: freq=noraman
keyword: PBEPBE/SDD
title: #p freq=noraman PBEPBE/SDD
converged: YES YES NO NO
title: Mulliken charges:
elementType: O O N N C C C C C C C C C C C H H H H H H H H H H
charge: -0.235627 -0.229846 -0.285292 -0.422963 -0.173999 -0.445852 -0.529862 0.162267 0.345367 0.105532 0.283592 -0.327903 -0.384828 -0.242891 -0.222190 0.273811 0.243201 0.254454 0.245819 0.261061 0.331061 0.298075 0.231400 0.233295 0.232317
chargesum: 0.00000
title: Mulliken charges with hydrogens summed into heavy atoms:
elementType: O O N N C C C C C C C C C C C
charge: -0.235627 -0.229846 -0.285292 -0.091902 0.099811 0.051804 -0.022982 0.162267 0.345367 0.105532 0.283592 -0.029828 -0.153428 -0.009596 0.010127
polarizability: 1.91286495e+02 5.24724957e+00 1.51234001e+02 7.09283516e-01 -1.32370860e+00 6.74854330e+01
1716.lowfreq: -4.5249 -0.0006 -0.0006 -0.0001 6.3030 9.3053 63.1362 81.0324 112.9894
frequency: 63.1283 81.0310 112.9874 142.1489 212.8506 229.6139 278.3678 316.6747 366.3697 400.2882 416.5115 453.0892 462.4025 528.5231 541.4209 571.3412 604.0381 625.8566 645.7480 656.9371 701.7857 733.2021 755.5596 761.4210 830.4280 861.5836 865.6382 889.1779 942.4409 944.1985 981.8861 988.5224 1019.9591 1037.3089 1060.1686 1107.4269 1119.5532 1153.8043 1175.7890 1200.4416 1207.9899 1231.6625 1263.9483 1274.9052 1284.8144 1307.3088 1314.6048 1342.6718 1358.5656 1376.8547 1412.2501 1452.0437 1469.7409 1482.4498 1501.7151 1597.8748 1614.3250 1636.3832 1638.8357 2931.2509 3007.2350 3043.3903 3092.2623 3116.2704 3127.1056 3146.4958 3167.8128 3194.9159 3518.6175
redmass: 4.7412 4.8293 4.8722 2.4295 5.3496 5.2430 5.9009 4.7567 6.0171 5.7642 5.1455 3.6645 5.2897 3.1659 5.0333 3.3260 4.9459 2.7752 6.0231 5.3041 1.6527 4.2087 3.1560 1.2870 2.1700 2.1089 1.8322 4.3091 1.8711 2.5913 1.3158 2.2684 2.0442 2.2238 2.1506 3.5142 1.7746 1.6849 1.0714 2.5333 1.4256 2.3106 1.5958 1.2706 1.4934 1.4836 1.7509 3.2463 3.2763 3.6706 2.5071 1.0850 2.7318 1.1036 3.1659 7.5778 6.4360 8.8660 7.5578 1.0825 1.0665 1.0638 1.0960 1.1035 1.0884 1.0897 1.0977 1.0956 1.0764
irintensity: 6.9816 0.5594 0.3956 2.6347 5.2522 5.0514 4.8863 4.6898 3.1535 0.1218 6.4591 8.1592 4.2022 6.4381 3.7920 1.6223 6.6850 4.2356 6.3788 6.4157 62.6894 0.4258 4.4476 142.0034 7.8716 0.2829 2.2986 8.2143 6.5518 1.0198 0.5129 9.5658 3.6395 4.2506 3.5542 30.4355 7.8949 23.7573 0.9790 92.4751 14.6706 21.7132 21.7018 10.8403 12.0408 7.7015 27.0097 280.7367 51.5162 27.4411 25.7338 8.4210 16.7090 12.0239 169.2431 64.4373 49.9145 134.4185 517.9904 30.6365 15.0362 11.7487 8.7422 18.9494 7.8449 10.7766 20.5660 3.9737 29.4015
temp: 298.150 k
press: 1.00000 atm
elementType: 8 8 7 7 6 6 6 6 6 6 6 6 6 6 6 1 1 1 1 1 1 1 1 1 1
symmnumber: 1
zpe: 508137.3 jmol-1
zpe.correction: 0.193539 hartree
zpe.thermalcorrener: 0.204999 hartree
zpe.thermalcorrenthalpy: 0.205944 hartree
zpe.thermalcorrgfe: 0.155894 hartree
zpe.sumelectzpe: -684.103328 hartree
zpe.sumelectthermal: -684.091868 hartree
zpe.sumelectthermalent: -684.090924 hartree
zpe.sumelectthermalfe: -684.140974 hartree
dipole: -1.3245 1.3158 1.4138
dipole: 2.3419
quadrupole: -74.6423 -99.7349 -87.5737
quadrupole: -9.4210 2.9681 -3.1226
quadrupole: 12.6747 -12.4180 -0.2568 -9.4210 2.9681 -3.1226
hfenergy: -684.2968673 hartree
pointgroup: C01 [X(C11H10N2O2)]
dipole: -0.5249631 0.5105024 0.5592298 debye
dipolederiv: -0.4912606 -0.229734 -0.0780226 0.2631149 -1.1706415 -0.1940424 0.0618826 -0.2276289 -0.3899847 -0.9708359 -0.3853478 0.0035132 -0.5529574 -0.9975398 0.0671864 0.110833 0.1607345 -0.3673684 -1.322173 0.5233873 0.0256114 0.4791927 -0.9710904 -0.1435093 0.1015857 -0.0904536 -0.2173154 -1.2616435 -0.7089098 0.059451 -0.1554869 -0.4434694 0.0068625 -0.1113494 -0.0303252 -0.3066244 0.2043139 0.2147447 0.0985881 0.2188069 0.0984445 0.1664352 0.0550989 0.1700628 0.3417068 0.0534389 -0.0064692 0.0374695 0.0689636 0.0314701 -0.0006352 -0.004671 -0.0101976 0.1207575 -0.3320855 -0.0677172 -0.0557272 -0.0484431 0.0004127 -0.0270076 -0.0871606 -0.0213163 0.1237751 1.0645963 -0.2237158 0.0050447 -0.6981176 1.6882404 0.3538859 -0.0415585 0.3595975 0.242203 0.907775 -0.2518322 -0.0245378 -0.2983539 -0.1078818 -0.0478151 0.0207344 -0.021412 0.0509998 1.7441407 0.7248754 0.0335751 0.278565 0.9268329 -0.1767681 0.0769614 -0.2324328 0.2327697 0.2883243 0.478768 -0.082408 0.6440755 0.5341044 -0.0488715 -0.0884386 -0.0988871 0.0565888 -0.1340715 0.0205641 -0.0030494 -0.060019 0.0331858 -0.0089918 -0.0190947 0.0305864 -0.1364166 -0.0732 -0.185566 0.0225412 -0.048328 0.0233443 -0.0153618 0.0307226 -0.0234147 -0.1854255 -0.0512723 0.0367412 -0.0005391 0.1017838 0.0183131 -0.0144704 -0.0076938 0.0007411 -0.1703681 0.0251894 0.0503836 -0.0015533 -0.0987657 -0.0065941 -0.0147309 -0.0103558 -0.010481 -0.1541185 0.0286105 -0.0390487 0.0216601 -0.0190734 0.0005755 -0.0136043 -0.0422933 -0.0780428 -0.1321765 -0.0333544 -0.0447915 -0.0700045 -0.0747331 0.0432562 -0.0404923 -0.0985375 -0.0523248 0.0225408 0.0931384 0.0126409 0.0019381 -0.0235965 0.0367615 0.0543633 0.0423837 0.0514443 -0.0668854 0.0422817 0.0238193 -0.0310619 -0.011388 0.0352256 0.0543243 -0.0822124 0.0949352 -0.0455395 0.0378115 0.0389092 0.0556856 0.0391075 0.0345561 -0.0537698 0.1087495 -0.0731364 0.015646 0.1026064 0.0035829 -0.0207771 -0.0145124 0.1867032 0.0359069 0.0049581 0.0661576 0.3076161 0.1305436 0.0468385 -0.0055082 0.0148611 0.0484999 0.0160022 -0.0208229 -0.0001688 0.167702 0.0765263 0.02712 0.0011667 0.0661251 -0.1035352 0.0239154 -0.0053249 0.0247231 0.1647849 -0.0070582 -0.0862787 0.0084577 -0.1078958 -0.0262409 0.0150911 0.0088162 0.0081797 0.1614657 -0.1223422 0.0270359 -0.0015131 0.0370746 0.087067 0.0060972 -0.0032129 0.00306 0.1636668 unknown
polarizability: 191.1036741|5.9006916|151.4118111|-0.3310449|-1.603367|67.4904445 unknown
InChI: InChI=1S/C11H10N2O2/c14-10-6-5-9-11(15)12-7-3-1-2-4-8(7)13(9)10/h1-4,9,12H,5-6H2
charge 0 multiplicity 1
25 atoms
O  0.939117 -2.848703 -0.479868
O  1.783714 2.906089 -0.264379
N  0.660857 -0.556078 0.078825
N  -0.357981 1.992658 -0.22986
C  1.516232 0.584331 0.509285
C  2.934944 0.188386 0.023836
C  2.892811 -1.357855 -0.004833
C  1.411714 -1.719499 -0.181894
C  -0.753008 -0.414114 0.066529
C  1.017162 1.926602 -0.043311
C  -1.266314 0.911055 -0.060386
C  -1.650809 -1.5054 0.147236
C  -2.660534 1.134915 -0.070575
C  -3.043062 -1.272688 0.121442
C  -3.550282 0.04329 0.019381
H  1.490923 0.663737 1.619008
H  3.714207 0.594603 0.685421
H  3.103346 0.601893 -0.984744
H  3.244415 -1.802189 0.946263
H  3.48709 -1.807938 -0.815587
H  -0.728066 2.902102 -0.522235
H  -1.2483 -2.518428 0.204943
H  -3.045373 2.157973 -0.159518
H  -3.730097 -2.12278 0.182482
H  -4.630408 0.22084 0.005639
