program: Gaussian 09
title: 000258123
version: EM64L-G09RevD.01
frameworkgroup: C1[X(C11H13N5O3)]
method: RPBEPBE
basis: SDD
operation: Freq
keyword: #p
keyword: freq=noraman
keyword: PBEPBE/SDD
title: #p freq=noraman PBEPBE/SDD
converged: YES YES NO NO
title: Mulliken charges:
elementType: O O O N N N N N C C C C C C C C C C C H H H H H H H H H H H H H
charge: -0.237355 -0.261859 -0.234400 -0.175582 0.051119 -0.082485 -0.051043 -0.322186 0.186332 0.037952 0.038683 0.118765 -0.610029 -0.619390 -0.361986 0.001667 0.276192 -0.603989 -0.503384 0.273309 0.270044 0.247763 0.252022 0.273418 0.268186 0.336188 0.216807 0.248100 0.247554 0.233179 0.246825 0.239581
chargesum: 0.00000
title: Mulliken charges with hydrogens summed into heavy atoms:
elementType: O O O N N N N N C C C C C C C C C C C
charge: -0.237355 -0.261859 -0.234400 -0.175582 0.051119 -0.082485 -0.051043 0.014002 0.186332 0.037952 0.038683 0.118765 -0.066675 0.153813 -0.093800 0.001667 0.276192 0.108472 0.216201
polarizability: 2.93989259e+02 -1.69449862e+01 1.55629878e+02 2.41894938e+01 2.76542954e+00 9.80852558e+01
1716.lowfreq: -6.1940 -0.0007 0.0003 0.0007 3.0212 6.0902 21.6959 35.3178 50.4961
frequency: 21.6173 35.2997 50.4818 64.1346 72.3305 103.3444 109.1230 113.4255 142.5431 149.9038 162.2049 163.8327 216.2345 226.0604 256.2905 284.7558 299.2222 324.5130 366.8244 395.0725 427.9949 462.0243 473.0767 492.1112 514.9164 531.9508 559.7309 565.9744 614.8656 645.5987 663.6365 688.6662 710.1462 764.4454 802.0360 807.7820 825.6519 856.9393 925.6045 938.7761 941.8199 972.5583 1000.5153 1081.6273 1095.3689 1114.6504 1124.0244 1125.1357 1131.9607 1137.8676 1149.4264 1173.4819 1214.2114 1235.1097 1262.8610 1295.9987 1301.1443 1318.1921 1352.9673 1388.8562 1415.1490 1420.9473 1424.0741 1435.0128 1453.4722 1457.5007 1459.2398 1464.3466 1470.6041 1475.5851 1486.6082 1496.7601 1540.1875 1552.8351 1568.0173 1603.6691 1649.8793 2987.6918 3005.0362 3014.8333 3023.3642 3065.4648 3089.2253 3107.7316 3108.1149 3111.2424 3140.4124 3149.3254 3150.7157 3578.1410
redmass: 4.8612 4.7195 6.0220 1.0547 4.1426 1.7846 2.0886 1.0299 3.3556 4.4300 4.1539 3.8602 4.8735 5.9061 2.6327 3.1108 6.7611 4.7258 5.1378 8.3280 9.3299 3.9780 4.8239 6.4756 7.0104 3.4717 1.1589 4.7941 5.5570 5.2823 6.6677 8.1134 8.8157 9.3250 8.7943 7.4143 4.7240 6.8333 4.5163 2.8079 1.4853 3.7854 4.0053 3.2024 2.8701 1.2690 1.2930 1.3253 3.5378 2.3322 1.4418 1.4889 2.3850 3.8312 2.7839 3.3326 1.8813 2.2089 5.6277 1.9738 1.2397 1.4624 1.2158 1.3698 1.0498 1.0405 1.4553 1.0506 1.5290 1.1260 1.1610 2.5004 8.9390 6.7080 5.1055 9.2435 9.0283 1.0347 1.0295 1.0326 1.0591 1.1010 1.1009 1.1047 1.1016 1.1007 1.1027 1.1049 1.0935 1.0775
irintensity: 1.5730 2.2810 1.3534 0.1568 0.2828 1.4354 0.7960 0.1591 0.2322 0.3590 8.4459 4.5996 3.7510 1.5693 5.3005 6.1409 1.8972 28.2044 5.5399 2.5324 3.5603 8.6792 22.5039 24.0441 7.3827 5.6101 108.8552 7.9693 14.3733 2.9694 2.9320 1.2989 9.0164 5.8018 22.6067 4.0244 5.6877 1.8234 6.3770 10.9494 14.0555 24.8788 2.6731 11.8685 40.0357 1.8269 1.9699 4.2811 433.8916 1.4902 12.3012 15.3967 3.0588 2.3301 4.1508 34.8001 37.1494 112.2294 10.3420 26.2200 59.5898 32.8677 6.5874 26.9645 14.5266 13.5027 29.2949 13.6116 67.7831 28.2418 14.5230 42.1577 193.6356 633.3321 771.6552 80.3784 143.8273 61.5999 39.1032 17.5177 4.5546 28.5500 1.6602 24.8922 13.5997 26.6386 1.0060 18.4963 6.2907 131.5556
temp: 298.150 k
press: 1.00000 atm
elementType: 8 8 8 7 7 7 7 7 6 6 6 6 6 6 6 6 6 6 6 1 1 1 1 1 1 1 1 1 1 1 1 1
symmnumber: 1
zpe: 634930.6 jmol-1
zpe.correction: 0.241832 hartree
zpe.thermalcorrener: 0.260410 hartree
zpe.thermalcorrenthalpy: 0.261354 hartree
zpe.thermalcorrgfe: 0.193265 hartree
zpe.sumelectzpe: -925.033096 hartree
zpe.sumelectthermal: -925.014518 hartree
zpe.sumelectthermalent: -925.013574 hartree
zpe.sumelectthermalfe: -925.081663 hartree
dipole: 3.6199 0.7462 0.0465
dipole: 3.6963
quadrupole: -74.4016 -112.0454 -112.3917
quadrupole: 9.3138 0.8920 2.0539
quadrupole: 25.2113 -12.4325 -12.7788 9.3138 0.8920 2.0539
hfenergy: -925.2749286 hartree
pointgroup: C01 [X(C11H13N5O3)]
dipole: -1.4249426 0.2834362 -0.0634428 debye
polarizability: 294.3374576|21.3737051|152.2436213|18.4951939|-14.0443134|101.1233138 unknown
InChI: InChI=1S/C11H13N5O3/c1-12-11-13-5-7-9(15-11)16(2)10(18)6(14-7)4-8(17)19-3/h5,12H,4H2,1-3H3
charge 0 multiplicity 1
32 atoms
O  1.717769 2.093211 0.278649
O  4.955983 -0.29357 0.109212
O  3.196973 -0.476808 -1.407919
N  -0.48535 1.298072 0.030452
N  0.450221 -1.267774 0.863978
N  -2.692336 0.458782 -0.176206
N  -3.160668 -1.905772 0.365339
N  -4.84807 -0.46217 -0.347278
C  -1.384721 0.23976 0.131885
C  1.296483 -0.250142 0.751466
C  -0.889211 -1.037524 0.563567
C  0.900888 1.126178 0.341956
C  2.759818 -0.462557 1.041518
C  -0.957872 2.628504 -0.41049
C  -1.855462 -2.078849 0.658984
C  -3.523302 -0.624232 -0.047583
C  3.606958 -0.405396 -0.229655
C  -5.428071 0.802475 -0.803417
C  5.89868 -0.244108 -1.035673
H  2.891969 -1.455759 1.505132
H  3.147387 0.301688 1.73737
H  -1.717818 3.010592 0.2904
H  -1.415877 2.550307 -1.40949
H  -0.082521 3.293619 -0.433657
H  -1.533654 -3.074317 0.982587
H  -5.424039 -1.297587 -0.23896
H  -6.508834 0.661473 -0.965364
H  -4.9613 1.136786 -1.747535
H  -5.275428 1.601414 -0.055737
H  6.892033 -0.145733 -0.576285
H  5.668175 0.621992 -1.678094
H  5.824597 -1.168855 -1.632551
