program: Gaussian 09
title: 000258116
version: EM64L-G09RevD.01
frameworkgroup: C1[X(C13H14N2O3)]
method: RPBEPBE
basis: SDD
operation: Freq
keyword: #p
keyword: freq=noraman
keyword: PBEPBE/SDD
title: #p freq=noraman PBEPBE/SDD
converged: YES YES NO NO
title: Mulliken charges:
elementType: O O O N N C C C C C C C C C C C C C H H H H H H H H H H H H H H
charge: -0.258645 -0.266484 -0.239282 -0.200766 0.027549 0.003335 -0.474437 0.323980 0.035675 0.097890 -0.523937 -0.334841 -0.659450 -0.339980 -0.234515 -0.230773 0.253661 -0.506558 0.249000 0.246635 0.295500 0.258633 0.251954 0.242517 0.241596 0.290540 0.265894 0.232683 0.237933 0.241794 0.232323 0.240576
chargesum: 0.00000
title: Mulliken charges with hydrogens summed into heavy atoms:
elementType: O O O N N C C C C C C C C C C C C C
charge: -0.258645 -0.266484 -0.239282 -0.200766 0.027549 0.003335 0.021198 0.323980 0.035675 0.097890 0.030196 -0.082887 0.115203 -0.074085 -0.001832 0.007160 0.253661 0.208135
polarizability: 2.60838155e+02 2.40279229e+01 1.61338582e+02 1.69364292e+01 -2.16263463e+00 9.84382010e+01
1716.lowfreq: -9.3764 -4.6458 -0.0004 0.0002 0.0004 5.9099 21.8741 30.6042 42.9851
frequency: 21.7442 30.5622 42.9776 67.5068 96.8285 105.0627 108.3514 143.8342 164.8906 179.1703 204.1136 248.7724 274.5342 289.9560 300.1617 331.5064 379.9102 404.3011 447.1157 470.0658 485.0371 508.2270 530.8527 557.0134 562.9094 593.1961 636.6265 671.6043 697.4477 740.2157 763.2840 770.2615 791.2938 840.5438 850.8703 866.3627 884.8777 951.1033 954.6615 987.7320 989.9077 1024.9457 1034.2301 1055.3717 1086.1097 1113.3419 1119.9816 1123.6944 1131.1230 1148.5070 1158.8972 1172.5409 1224.3184 1234.1878 1261.3055 1278.5745 1288.8822 1307.5247 1326.1432 1353.5116 1393.9953 1420.0644 1422.4055 1436.9086 1447.8206 1452.5637 1452.8472 1464.6756 1469.3820 1482.0566 1493.9900 1541.0866 1562.8269 1583.9671 1618.6960 1646.5510 2993.0988 3002.6827 3004.8324 3019.9744 3061.2512 3081.8990 3099.4992 3104.1567 3124.7943 3139.2115 3147.9415 3155.4860 3169.5979 3178.8254
redmass: 5.8021 5.4148 4.5058 2.6834 1.0934 4.0312 4.3334 4.0279 3.3731 4.1310 1.1210 3.4958 3.7378 5.1822 3.4480 4.8480 4.7662 4.5630 8.6010 5.2142 3.8894 4.6186 6.7566 2.9873 3.8305 4.1368 5.8723 5.1290 6.0851 4.4056 1.4144 1.6748 3.8787 5.4487 4.3887 1.5153 3.9149 5.3834 1.4135 1.3280 4.4776 2.6112 2.0538 4.0994 2.5505 1.2665 1.3262 1.5675 2.7842 1.4378 1.4750 1.1188 1.8510 3.3794 1.4137 1.6671 2.1352 2.0565 2.6613 1.6494 7.9631 1.2849 1.1876 1.0940 1.1165 1.0506 2.0632 1.0509 2.1937 1.4094 1.0448 8.8418 7.0649 8.5348 6.8423 8.9328 1.0344 1.0361 1.0533 1.0607 1.0989 1.1025 1.1020 1.1045 1.0994 1.0863 1.1047 1.0900 1.0943 1.1000
irintensity: 1.5177 0.2915 1.7938 0.8481 0.2213 1.6070 2.2194 1.3672 4.1248 6.7608 0.3084 7.8735 13.0630 9.2295 2.2418 6.9836 12.3939 4.4771 6.8025 14.8214 6.0771 2.5317 17.7632 1.6027 2.1418 8.8970 0.7792 5.3223 7.4291 1.2144 95.5409 13.2817 2.5293 9.5133 10.6613 0.0252 7.9003 15.0452 4.5257 0.0768 1.9703 2.4789 16.9039 39.4995 32.9110 0.2386 1.4555 11.0751 296.5710 5.0052 16.1561 2.8948 23.5695 1.6285 30.3265 73.1818 87.8244 2.0150 2.7394 19.2302 10.7818 20.9785 24.4935 0.3265 43.5662 13.5593 6.3868 13.8376 80.8603 8.8587 19.6018 35.3462 250.2080 131.0933 0.6232 172.4572 32.5414 54.3481 1.7872 9.1600 4.9546 19.9268 6.1896 28.3263 1.2526 2.2786 17.5086 8.6603 14.7383 17.2449
temp: 298.150 k
press: 1.00000 atm
elementType: 8 8 8 7 7 6 6 6 6 6 6 6 6 6 6 6 6 6 1 1 1 1 1 1 1 1 1 1 1 1 1 1
symmnumber: 1
zpe: 655324.3 jmol-1
zpe.correction: 0.249600 hartree
zpe.thermalcorrener: 0.266572 hartree
zpe.thermalcorrenthalpy: 0.267516 hartree
zpe.thermalcorrgfe: 0.202832 hartree
zpe.sumelectzpe: -837.669367 hartree
zpe.sumelectthermal: -837.652395 hartree
zpe.sumelectthermalent: -837.651450 hartree
zpe.sumelectthermalfe: -837.716135 hartree
dipole: -3.8594 0.4465 -2.4641
dipole: 4.6007
quadrupole: -78.3684 -101.9270 -110.8886
quadrupole: -5.3868 -6.0221 -0.1649
quadrupole: 18.6929 -4.8656 -13.8273 -5.3868 -6.0221 -0.1649
hfenergy: -837.9189669 hartree
pointgroup: C01 [X(C13H14N2O3)]
dipole: 1.5326714 0.0023638 0.9628989 debye
polarizability: 260.7341554|-27.133098|159.4083846|10.5545295|12.474774|100.4723976 unknown
InChI: InChI=1S/C13H14N2O3/c1-15-11-6-4-3-5-9(11)14-10(13(15)17)7-8-12(16)18-2/h3-6H,7-8H2,1-2H3
charge 0 multiplicity 1
32 atoms
O  -0.508007 2.256901 -0.002024
O  -4.815367 -0.3551 1.136557
O  -4.509133 -0.241636 -1.169908
N  1.657636 1.366346 0.21724
N  0.622945 -1.15097 -0.610432
C  -0.181335 -0.098192 -0.520742
C  -1.640903 -0.247755 -0.877549
C  2.528847 0.264327 0.130114
C  1.981469 -0.996905 -0.288369
C  0.274433 1.257418 -0.089917
C  -2.561036 -0.116132 0.361047
C  3.912839 0.359427 0.438689
C  2.161726 2.689607 0.638216
C  2.831049 -2.130231 -0.387003
C  4.732032 -0.779587 0.332751
C  4.19731 -2.02946 -0.080033
C  -4.026318 -0.243687 -0.014807
C  -6.277104 -0.446256 0.902631
H  -1.930574 0.534515 -1.602719
H  -1.779932 -1.231088 -1.355259
H  -2.413472 0.874245 0.831802
H  -2.32348 -0.876982 1.126327
H  4.348361 1.309802 0.758427
H  2.936168 3.049954 -0.061338
H  2.583497 2.638343 1.657408
H  1.307421 3.382445 0.629188
H  2.375794 -3.071335 -0.709793
H  5.797469 -0.696111 0.57325
H  4.847802 -2.906045 -0.157803
H  -6.635298 0.447463 0.364339
H  -6.718597 -0.508325 1.907115
H  -6.51384 -1.344296 0.307299
