program: Gaussian 09
title: 000258074
version: EM64L-G09RevD.01
frameworkgroup: C1[X(C7H14O5)]
method: RPBEPBE
basis: SDD
operation: Freq
keyword: #pfreq=noraman
keyword: PBEPBE/SDD
title: #p freq=noraman PBEPBE/SDD
converged: NO YES NO NO
title: Mulliken charges:
elementType: O O O O O C C C C C C C H H H H H H H H H H H H H H
charge: -0.478821 -0.480238 -0.483241 -0.434313 -0.497978 -0.116941 -0.115479 -0.518116 -0.179018 -0.062744 -0.197077 -0.400151 0.243738 0.207902 0.236109 0.229351 0.276315 0.232153 0.282122 0.216114 0.220619 0.371763 0.368933 0.372779 0.337725 0.368497
chargesum: 0.00000
title: Mulliken charges with hydrogens summed into heavy atoms:
elementType: O O O O O C C C C C C C
charge: -0.107057 -0.111306 -0.110462 -0.096588 -0.129482 0.126797 0.092423 -0.052657 0.097297 0.169409 0.085045 0.036582
polarizability: 9.96410463e+01 -3.87971593e-01 8.98951480e+01 2.80233520e-01 -9.78522707e-01 7.84300896e+01
1716.lowfreq: -9.9193 -0.0006 -0.0002 0.0007 8.3738 13.6513 54.3845 82.8537 141.9218
frequency: 54.2965 82.8058 141.9008 151.9792 203.3460 225.5143 230.7874 267.0273 283.6718 292.9375 323.4404 344.9525 370.3553 395.2906 418.5065 444.2757 468.7764 491.5616 517.8627 532.3066 550.3553 655.8621 780.2963 794.4531 857.1276 880.9770 929.5368 951.0204 962.4097 974.4924 984.6295 1002.8988 1041.9958 1051.5363 1082.2397 1105.5242 1129.4798 1166.3362 1179.7428 1201.3854 1211.4387 1224.7067 1241.6132 1263.7683 1280.1389 1290.5556 1310.4675 1320.2388 1335.2568 1347.3296 1352.3041 1359.6265 1377.3502 1393.0718 1408.0800 1431.3139 1457.1657 1476.5757 2941.6446 2952.9911 2962.9685 2994.2698 3020.3505 3022.6648 3030.3040 3054.6891 3072.7517 3345.9199 3390.9223 3561.5746 3569.6666 3596.1667
redmass: 5.8226 5.8707 5.0639 3.4721 4.1343 3.5642 3.8412 1.2949 1.3826 2.6924 2.6083 3.4853 3.6249 3.4744 1.3533 2.6625 2.6230 4.0929 2.3089 2.3444 3.2565 1.1082 3.4805 2.7801 2.6298 2.3349 3.5047 4.2627 3.1750 2.9568 3.8786 3.5067 3.2452 2.6987 2.1281 2.1500 2.0202 1.1487 1.1555 1.1123 1.3035 1.3493 1.4711 1.1964 1.2413 1.3005 1.2673 1.2675 1.3184 1.2641 1.3300 1.3418 1.3545 1.3754 1.3710 1.4077 1.0861 1.0960 1.0809 1.0614 1.0789 1.0616 1.1080 1.0860 1.0868 1.1016 1.0872 1.0660 1.0682 1.0659 1.0661 1.0668
irintensity: 2.7672 8.9084 19.0536 1.6525 2.9797 7.2611 0.8455 89.0759 93.0875 35.6468 7.6207 14.3176 22.0956 21.0637 129.4050 20.6803 75.8233 42.1949 19.8311 27.6570 28.4117 154.7022 10.2305 15.3637 14.8612 28.3564 31.3584 69.7631 24.4062 28.9538 70.1757 23.0572 28.8835 47.9658 26.9188 28.3456 32.2292 16.9966 18.0060 6.6476 31.9588 25.7115 18.1917 11.0366 2.5609 15.3013 15.2786 43.8613 19.3546 15.3912 22.3791 2.7436 24.5002 5.5231 50.7295 50.7159 10.4943 14.6176 8.3281 18.4037 64.8180 15.1496 43.0000 67.5013 18.2088 33.8988 17.3702 203.2473 111.9535 2.9140 12.4800 7.4168
temp: 298.150 k
press: 1.00000 atm
elementType: 8 8 8 8 8 6 6 6 6 6 6 6 1 1 1 1 1 1 1 1 1 1 1 1 1 1
symmnumber: 1
zpe: 562973.3 jmol-1
zpe.correction: 0.214425 hartree
zpe.thermalcorrener: 0.227165 hartree
zpe.thermalcorrenthalpy: 0.228109 hartree
zpe.thermalcorrgfe: 0.176494 hartree
zpe.sumelectzpe: -650.234391 hartree
zpe.sumelectthermal: -650.221651 hartree
zpe.sumelectthermalent: -650.220707 hartree
zpe.sumelectthermalfe: -650.272322 hartree
dipole: 4.7156 -1.4884 -0.7159
dipole: 4.9965
quadrupole: -66.1561 -71.6458 -78.8916
quadrupole: -7.1267 -3.2079 -5.3174
quadrupole: 6.0751 0.5854 -6.6605 -7.1267 -3.2079 -5.3174
hfenergy: -650.4488163 hartree
pointgroup: C01 [X(C7H14O5)]
dipole: 1.959218 0.1330307 0.0896001 debye
dipolederiv: -0.6080439 0.1889118 0.0663136 0.1794341 -0.7895033 -0.0206408 0.119377 -0.0234992 -0.5244825 -0.6275642 -0.3003247 0.0600678 -0.274462 -0.5081949 0.1326464 0.0943578 0.0905922 -0.6154637 -0.5610299 0.0719157 0.123607 0.0589932 -0.5362736 0.0542729 0.1745794 0.1092226 -0.7605908 -0.1782119 -0.0546639 -0.0185179 -0.0518652 -0.5815864 0.0272474 -0.0806906 0.0523964 -0.770689 -0.6086299 0.2178401 0.1956011 0.2164787 -0.7077018 0.0041147 0.2455724 -0.0101611 -0.4939079 -0.1286073 0.027063 0.0367333 0.0658055 -0.1388608 -0.0106162 0.0020949 -0.0017447 0.13704 0.2454514 -0.2205173 -0.0589589 -0.1709421 0.4790301 0.0992022 -0.1447359 0.0615581 0.3074535 -0.1450499 -0.0499622 0.0544223 -0.0398909 0.0862951 -0.0100071 0.0389504 -0.0007396 0.0598545 0.3407522 0.2096059 -0.089476 0.1163058 0.2419723 -0.126731 -0.1018289 -0.0749132 0.3615228 0.4019577 -0.0384764 -0.1408854 -0.0106711 0.3387346 -0.1635465 -0.1792264 -0.1744245 0.4158145 0.1970991 0.0141253 -0.0409483 0.0031457 0.3003837 -0.0287286 0.072983 -0.0388649 0.5135387 0.4857097 -0.2401207 -0.1179259 -0.2280082 0.5451636 0.0414424 -0.1049861 0.0492002 0.3526266 0.0426912 -0.0052281 -0.0408302 -0.0172686 0.0414859 -0.0155934 -0.0329432 0.0044007 -0.1715316 0.0159691 -0.0104244 -0.0185914 0.007909 -0.0065731 -0.0234658 -0.0025996 -0.027567 -0.1687049 0.0154006 -0.0548336 -0.0790068 -0.0178491 0.0374055 -0.0368908 -0.087795 -0.0869195 -0.0221603 0.0571988 0.0110919 0.0333738 0.0079938 -0.0603512 0.0827148 0.0472811 0.1311828 -0.0467054 0.0363353 -0.0174566 0.0169308 -0.0368041 -0.0062332 -0.0512588 -0.010049 -0.0448277 -0.0838302 -0.0301014 0.1043205 0.0046561 0.0852671 -0.1569433 0.037343 0.0148715 0.0117357 0.0136227 -0.1078422 -0.0091149 0.0296068 -0.0085425 0.0712922 0.0057392 0.0132854 0.0002541 0.0369544 0.0308252 0.0398123 0.0287508 0.0522039 0.0032817 -0.0054365 -0.0137068 -0.0528877 -0.1737813 -0.0383072 -0.0729544 0.0468921 -0.0767628 -0.1536775 0.0293794 0.07123 0.0593473 0.033721 0.4303623 0.0446088 -0.0141705 0.0808748 0.3835996 -0.0121981 -0.031336 -0.0326889 0.3231954 0.3258392 0.1692583 0.0059866 0.1386234 0.1443922 0.0173254 0.0165474 -0.0042833 0.2857815 0.2917666 -0.0404472 -0.0728936 -0.059187 0.3711289 0.0349781 -0.0566598 0.0484409 0.3324948 0.0342068 0.0241116 0.0840927 0.0285445 0.3183696 -0.0018879 0.0833401 0.0046732 0.3231447 0.0818226 -0.0081405 -0.0948298 -0.0493258 0.2833644 -0.0594043 -0.1479131 -0.0494829 0.3350826 unknown
polarizability: 98.9801425|-1.9587798|90.2568554|-2.5324474|-0.6923035|78.7292859 unknown
InChI: InChI=1S/C7H14O5/c8-2-3-1-4(9)6(11)7(12)5(3)10/h3-12H,1-2H2
charge 0 multiplicity 1
26 atoms
O  0.9321 -2.263586 -0.349544
O  -1.869775 -1.563044 1.018241
O  -1.042629 0.997929 1.940064
O  -1.672977 0.784095 -1.784526
O  3.286683 -0.992413 -0.382521
C  1.167575 0.237638 -0.348245
C  0.412802 -1.006216 0.200253
C  0.49704 1.578985 0.10385
C  -1.102373 -1.006816 -0.127573
C  -0.984696 1.42779 0.528235
C  -1.706871 0.397495 -0.365818
C  2.634022 0.243055 0.116552
H  1.185662 0.158889 -1.45685
H  0.524667 -0.991337 1.307521
H  1.022384 1.994268 0.984429
H  0.579782 2.331174 -0.702669
H  -1.258384 -1.629637 -1.028488
H  -1.489414 2.40881 0.455369
H  -2.781332 0.353129 -0.123874
H  2.670905 0.270267 1.226186
H  3.157884 1.133406 -0.28616
H  1.930285 -2.175936 -0.38582
H  -1.533672 -2.475994 1.205651
H  -1.509544 0.115538 2.000997
H  -0.741795 0.734601 -2.119105
H  4.227673 -1.03629 -0.085256
