program: Gaussian 09
title: 000258136
version: EM64L-G09RevD.01
frameworkgroup: C1[X(C16H16N2O6)]
method: RPBEPBE
basis: SDD
operation: Freq
keyword: #p
keyword: freq=noraman
keyword: PBEPBE/SDD
title: #p freq=noraman PBEPBE/SDD
converged: YES YES NO NO
title: Mulliken charges:
elementType: O O O O O O N N C C C C C C C C C C C C C C C C H H H H H H H H H H H H H H H H
charge: -0.254481 -0.232656 -0.272443 -0.119799 -0.219585 -0.196978 -0.416781 0.010365 -0.351133 0.053959 0.359744 0.053071 0.064423 0.093997 0.258404 -0.377942 -0.342161 -0.203396 -0.231080 0.187725 -0.259400 -0.659860 -0.256582 -0.662747 0.315467 0.337801 0.237310 0.273640 0.236816 0.241373 0.226366 0.237233 0.226610 0.238117 0.229218 0.255672 0.214140 0.221671 0.252609 0.231295
chargesum: 0.00000
title: Mulliken charges with hydrogens summed into heavy atoms:
elementType: O O O O O O N N C C C C C C C C C C C C C C C C
charge: -0.254481 -0.232656 -0.272443 -0.119799 -0.219585 -0.196978 -0.078981 0.010365 -0.035666 0.053959 0.359744 0.053071 0.064423 0.093997 0.258404 -0.140632 -0.068521 0.033419 0.010293 0.187725 0.204199 0.039170 0.208146 0.042829
polarizability: 2.85354087e+02 -2.59543557e+00 1.77912017e+02 -2.11900635e+01 -2.02533259e+01 1.74949188e+02
1716.lowfreq: -7.3052 -4.4735 -4.3954 -0.0008 -0.0007 -0.0001 20.6534 22.0424 34.0066
frequency: 20.5173 21.9962 33.9917 35.0950 46.5264 59.1656 68.6852 77.4016 92.5970 97.8790 99.4373 123.6803 132.1816 166.8572 196.6253 200.5721 230.4440 248.2303 254.6102 294.0680 299.4054 318.6836 336.2638 348.8357 384.0065 405.7207 420.6184 428.5568 452.9851 472.4858 500.0819 538.6293 544.8164 559.2607 595.2807 602.0789 660.0652 679.5700 704.6966 719.1649 727.3027 746.5979 759.1872 777.4899 779.6774 806.8086 814.1311 818.3509 824.7181 867.4403 870.9266 888.1936 900.2943 934.6477 958.6133 991.5474 1003.4466 1010.3893 1024.1172 1032.7919 1095.1546 1097.3668 1105.0151 1120.6385 1132.2588 1141.3260 1155.9865 1159.9194 1170.7492 1220.3733 1229.8746 1253.3610 1265.6781 1275.9998 1277.1021 1282.9112 1318.9423 1351.3666 1355.6546 1377.9671 1393.4123 1394.6463 1409.7999 1457.6957 1458.7759 1462.9462 1463.4958 1466.4871 1475.2102 1484.4799 1484.6101 1543.7553 1580.4941 1619.7071 1622.7815 1639.2447 1641.4456 1650.9472 2994.1815 2995.6962 3024.2622 3032.4128 3033.6549 3089.4822 3091.0384 3097.1045 3097.1616 3122.9920 3123.0311 3130.0157 3149.4577 3163.0299 3179.6631 3504.0742
redmass: 4.7256 5.4615 4.3096 4.5597 5.5434 3.0797 4.6070 5.8004 6.2246 5.3015 4.8867 5.8387 5.0388 3.4273 1.6639 1.7704 2.7997 3.2798 3.5560 3.0182 3.6978 4.5498 5.7786 13.0053 4.4910 6.7161 4.8737 4.3754 8.5035 3.1104 4.8242 7.1486 7.1397 3.9570 8.3192 7.3799 4.2871 5.2972 8.2306 2.0819 3.3042 2.4095 5.4422 1.5925 2.2883 1.5841 1.4139 2.7578 4.0324 4.9783 1.5305 5.8778 5.6501 4.6017 1.3756 1.3289 2.7060 3.1049 2.1239 3.5616 2.1505 2.1666 2.1223 1.8803 2.9048 4.9447 1.6895 1.7217 1.1265 2.4393 2.4899 1.9400 2.0695 1.1186 1.1326 2.1222 3.9533 1.2593 1.2898 2.7055 1.2272 1.2312 3.6066 1.0905 1.0915 1.0446 1.0488 3.3515 2.5354 1.0525 1.0515 10.3218 6.7807 5.9216 6.4760 9.9643 10.8772 11.5546 1.0364 1.0362 1.0803 1.0596 1.0597 1.0973 1.0974 1.1032 1.1033 1.1064 1.1063 1.0882 1.0900 1.0939 1.1000 1.0770
irintensity: 0.4562 1.1554 0.9444 2.7777 1.6286 1.1412 0.7014 0.0525 0.2583 0.8923 0.9989 0.0707 0.3944 0.8441 3.3920 0.7410 3.0374 0.8122 5.9767 8.1163 7.3048 9.7363 5.4947 4.3353 1.0251 30.2814 6.1204 3.0438 5.3751 12.0572 12.2762 4.8054 10.7071 0.5079 4.9044 8.7681 32.9866 1.4324 2.3460 5.5134 8.1795 2.7664 3.1594 89.0573 98.4287 9.3616 4.9152 2.5204 2.4579 27.0413 1.0812 0.1990 6.5159 32.3834 4.5891 0.0309 9.0871 183.1005 12.7188 97.5360 19.4237 52.0558 27.2315 67.8116 203.6916 166.0267 1.5074 31.8828 2.1465 59.6243 5.9331 126.2223 44.4407 3.7523 6.1685 57.3117 22.3299 1.8501 3.1815 4.9701 26.1765 23.0163 8.1430 8.5955 13.0844 14.8330 10.7382 17.4843 3.6071 12.7326 14.4213 7.6614 8.5764 198.7584 314.8120 131.8999 172.6977 66.6471 20.2880 17.9234 4.8916 21.8984 27.1972 37.1376 27.3017 1.1166 0.9292 21.3674 32.8951 4.3503 8.0532 12.0453 14.5265 36.3124
temp: 298.150 k
press: 1.00000 atm
elementType: 8 8 8 8 8 8 7 7 6 6 6 6 6 6 6 6 6 6 6 6 6 6 6 6 1 1 1 1 1 1 1 1 1 1 1 1 1 1 1 1
symmnumber: 1
zpe: 786384.8 jmol-1
zpe.correction: 0.299518 hartree
zpe.thermalcorrener: 0.322874 hartree
zpe.thermalcorrenthalpy: 0.323818 hartree
zpe.thermalcorrgfe: 0.243339 hartree
zpe.sumelectzpe: -1178.410860 hartree
zpe.sumelectthermal: -1178.387504 hartree
zpe.sumelectthermalent: -1178.386559 hartree
zpe.sumelectthermalfe: -1178.467039 hartree
dipole: 4.4133 -0.2587 4.4120
dipole: 6.2458
quadrupole: -104.2511 -131.6036 -146.3903
quadrupole: -2.6936 0.7477 8.8622
quadrupole: 23.1639 -4.1886 -18.9753 -2.6936 0.7477 8.8622
hfenergy: -1178.7103778 hartree
pointgroup: C01 [X(C16H16N2O6)]
dipole: -1.8884796 0.0211264 1.5720619 debye
polarizability: 280.0930829|-9.8613675|175.0578126|30.9618889|18.668788|183.0643964 unknown
InChI: InChI=1S/C16H16N2O6/c1-3-23-15(21)11(13(19)16(22)24-4-2)12-14(20)18-10-8-6-5-7-9(10)17-12/h5-8,11,18H,3-4H2,1-2H3
charge 0 multiplicity 1
40 atoms
O  3.512056 0.694257 0.122667
O  0.293155 1.45855 2.248784
O  0.298011 -2.64913 0.487782
O  2.095245 -1.050613 -2.110859
O  1.919055 2.16754 -0.744574
O  0.368595 -3.340773 -1.747607
N  -1.83716 1.658033 1.296973
N  -1.007794 0.080093 -0.866673
C  1.269584 -0.106933 0.0123
C  -0.159973 0.382491 0.103259
C  -2.767814 1.377173 0.289938
C  -2.32592 0.558801 -0.803132
C  -0.507166 1.198253 1.301235
C  1.396212 -1.181894 -1.088127
C  2.230451 1.063308 -0.251829
C  -4.098413 1.86396 0.327269
C  -3.235311 0.238195 -1.844657
C  -4.980353 1.532831 -0.717377
C  -4.553963 0.719859 -1.804546
C  0.624266 -2.506623 -0.859163
C  4.593088 1.70549 -0.112563
C  4.684202 2.676058 1.067529
C  -0.402955 -3.918201 0.876379
C  0.61282 -5.03017 1.149212
H  1.5549 -0.560352 0.980674
H  -2.110659 2.238433 2.09717
H  -4.433151 2.49205 1.161169
H  -2.869094 -0.383549 -2.666969
H  -6.008737 1.908633 -0.691709
H  -5.253847 0.474679 -2.609025
H  5.499522 1.089363 -0.220706
H  4.374216 2.232609 -1.057452
H  -0.96411 -3.633885 1.780361
H  -1.096336 -4.191702 0.061852
H  4.846048 2.13221 2.013887
H  3.762047 3.274044 1.154941
H  5.533624 3.367525 0.914043
H  0.085506 -5.929378 1.517912
H  1.155314 -5.304049 0.229101
H  1.341341 -4.71889 1.917236
