program: Gaussian 09
title: 000258081
version: EM64L-G09RevD.01
frameworkgroup: C1[X(C16H25NO4)]
method: RPBEPBE
basis: SDD
operation: Freq
keyword: #p
keyword: freq=noraman
keyword: PBEPBE/SDD
title: #p freq=noraman PBEPBE/SDD
converged: YES YES NO NO
title: Mulliken charges:
elementType: O O O O N C C C C C C C C C C C C C C C C H H H H H H H H H H H H H H H H H H H H H H H H H
charge: -0.260965 -0.309722 -0.298616 -0.280849 -0.416029 -0.468820 0.079723 -0.379044 0.463438 -0.276035 -0.255474 -0.425361 -0.362396 0.230195 -0.321885 -0.368130 -0.657398 -0.669787 0.174558 -0.257182 -0.668446 0.215859 0.248391 0.173563 0.202179 0.227611 0.350028 0.185247 0.229690 0.223418 0.225323 0.219843 0.236923 0.263659 0.261498 0.217326 0.235281 0.211822 0.223188 0.210276 0.236194 0.231069 0.214170 0.210148 0.252493 0.223023
chargesum: 0.00000
title: Mulliken charges with hydrogens summed into heavy atoms:
elementType: O O O O N C C C C C C C C C C C C C C C C
charge: -0.260965 -0.309722 -0.298616 -0.280849 -0.066000 -0.004570 0.253286 0.050746 0.463438 0.138902 0.193267 -0.205518 -0.125473 0.230195 -0.058226 -0.106632 0.007031 -0.000128 0.174558 0.188057 0.017219
polarizability: 3.34124730e+02 -1.57734881e+01 1.86134793e+02 -1.17168817e+01 -1.03117161e+01 1.31402731e+02
1716.lowfreq: -8.7743 -2.9479 -0.8818 -0.0014 -0.0012 0.0004 13.4641 27.5986 31.3766
frequency: 13.2708 27.5947 31.3463 35.9867 43.7906 56.0926 60.3480 68.1160 87.7459 91.9314 110.0494 123.9863 147.2835 161.6403 176.3291 208.6106 218.8089 230.2544 247.5998 250.7678 286.9202 312.0547 320.2750 339.1145 377.1334 391.3722 409.2528 419.3560 437.1697 474.4189 507.1465 508.4996 509.4279 523.8445 620.9861 629.4523 650.4457 676.4418 732.6246 753.2549 759.6412 790.3489 797.4416 812.1602 817.7907 825.6374 835.8487 839.4994 845.1553 884.7657 899.3924 935.8600 968.4831 972.8769 981.7787 989.2193 1009.3548 1026.8605 1045.9164 1053.9419 1060.6396 1081.6547 1085.3692 1094.8947 1106.0716 1118.6083 1137.8481 1150.8683 1152.8677 1159.5047 1182.7263 1219.2527 1240.4870 1259.9751 1265.1591 1272.8041 1280.7647 1301.2834 1313.0588 1322.2898 1333.4954 1348.4967 1354.2175 1357.8966 1365.6773 1375.8994 1376.9573 1386.6108 1387.4927 1387.9522 1445.8720 1448.6527 1453.1063 1460.9032 1461.8251 1463.2263 1466.9596 1472.9841 1482.4874 1483.2502 1485.2084 1486.5236 1493.9819 1535.2223 1567.1030 1610.3791 1634.2480 2905.5470 2910.7872 2952.8588 2980.9774 2982.9345 2984.1354 2989.8461 3010.1730 3022.3474 3023.3932 3060.4131 3067.0417 3079.9038 3082.7576 3083.7225 3084.7839 3088.2696 3096.6648 3098.6269 3114.7056 3120.1829 3140.7190 3161.7731 3171.4351 3448.4946
redmass: 4.1368 3.9468 3.8844 3.3164 3.5887 3.4295 2.6916 3.0201 3.4211 4.3271 2.8573 4.1121 3.9275 3.7888 1.8486 1.4549 1.4547 1.8388 1.8611 1.6654 4.7124 3.1790 3.1447 3.4515 3.5809 3.5016 3.3147 3.0164 3.4790 3.8043 2.7189 3.9805 2.5577 4.1561 1.7646 5.8348 2.0154 4.0486 2.9287 4.6597 2.3034 1.1411 1.2250 1.4237 1.3360 3.0995 1.9429 2.4364 3.4824 2.1162 2.6474 2.6781 2.5978 1.3746 1.3538 3.5692 2.5586 4.3192 4.1281 4.8496 2.3809 2.0777 2.0508 2.1363 2.4049 1.6840 1.8665 1.6621 1.6554 1.8198 1.1582 1.3626 1.1880 2.6132 1.1740 1.1108 1.1175 1.3483 1.3076 1.6211 1.1739 1.2405 1.4020 1.2987 1.4800 1.6640 2.7461 1.2275 1.2410 1.2232 1.1256 4.0015 1.1057 1.0678 1.0443 1.0486 1.0490 1.0663 1.1135 1.1443 1.0692 1.2923 1.1618 3.3091 4.2603 8.6038 6.6122 1.0724 1.0795 1.0666 1.0904 1.0364 1.0360 1.0362 1.0618 1.0623 1.0588 1.0967 1.1006 1.0980 1.0987 1.0983 1.1015 1.1031 1.1015 1.1034 1.1047 1.0895 1.0871 1.0958 1.0949 1.0789
irintensity: 0.7295 0.9946 0.7318 0.7542 0.4302 1.5415 1.1082 1.1509 0.9983 0.7250 0.5178 4.0189 4.2773 4.2994 2.1053 2.1360 0.6446 3.9993 1.5997 0.3661 0.4689 3.4810 13.8687 13.2825 9.2466 2.9527 4.5834 0.2525 5.1019 7.2929 9.4569 1.3380 9.1507 6.6755 55.9374 4.8887 36.5833 33.4775 12.3432 12.0261 52.2043 12.1634 1.6724 4.3824 0.6913 6.4719 75.1028 9.2360 5.2547 1.1785 67.4637 100.0277 53.0200 2.9231 1.3838 16.6369 11.9410 124.9498 267.1587 350.8092 25.9896 10.6459 48.8820 27.8105 11.0358 28.0253 14.7321 44.5805 66.0432 13.0841 177.8351 14.8564 41.8211 298.7394 26.3881 7.3952 0.2972 17.2150 5.0406 21.8090 15.0927 26.7429 4.5202 3.0844 5.7625 19.8339 167.5599 21.7524 21.9742 32.2015 20.8750 5.8755 43.7548 6.0540 14.6873 7.4616 9.4313 5.7850 12.2932 10.1362 14.3808 5.3828 99.0217 253.7854 130.0177 391.7606 377.5790 40.6243 82.4795 62.3174 31.9573 14.9864 20.8480 30.3873 46.3508 32.2107 44.8534 2.9247 8.9220 73.4478 37.5049 41.4518 18.1075 7.5131 51.5323 44.2407 34.4292 17.8932 5.7345 18.8052 3.1301 468.4956
temp: 298.150 k
press: 1.00000 atm
elementType: 8 8 8 8 7 6 6 6 6 6 6 6 6 6 6 6 6 6 6 6 6 1 1 1 1 1 1 1 1 1 1 1 1 1 1 1 1 1 1 1 1 1 1 1 1 1
symmnumber: 1
zpe: 1016574.4 jmol-1
zpe.correction: 0.387193 hartree
zpe.thermalcorrener: 0.410832 hartree
zpe.thermalcorrenthalpy: 0.411776 hartree
zpe.thermalcorrgfe: 0.330342 hartree
zpe.sumelectzpe: -978.705932 hartree
zpe.sumelectthermal: -978.682293 hartree
zpe.sumelectthermalent: -978.681348 hartree
zpe.sumelectthermalfe: -978.762783 hartree
dipole: 6.9110 1.8413 1.4115
dipole: 7.2901
quadrupole: -111.3241 -118.5610 -131.8252
quadrupole: -12.1672 15.9791 1.6023
quadrupole: 9.2460 2.0091 -11.2551 -12.1672 15.9791 1.6023
hfenergy: -979.0931249 hartree
pointgroup: C01 [X(C16H25N1O4)]
dipole: -2.683378 -0.5672598 -0.8389777 debye
polarizability: 326.4184828|32.9187056|166.8548287|-18.0661936|-33.4689367|158.3889415 unknown
InChI: InChI=1S/C16H25NO4/c1-4-19-15(20-5-2)11-12-17-14-9-7-13(8-10-14)16(18)21-6-3/h7-10,15,17H,4-6,11-12H2,1-3H3
charge 0 multiplicity 1
46 atoms
O  -5.415448 -0.382058 0.413141
O  -3.551675 0.722854 -0.57602
O  5.043244 1.590335 -1.102531
O  5.48359 -0.250674 0.272345
N  -1.013056 0.243548 0.532316
C  -3.19798 -0.486914 1.466193
C  -3.982598 -0.473736 0.146039
C  -1.690698 -0.786585 1.322095
C  0.356303 0.302898 0.34572
C  -6.233074 -1.5092 -0.084176
C  -4.205524 0.95135 -1.886041
C  0.915014 1.322806 -0.49345
C  1.2512 -0.625256 0.970076
C  3.18443 0.487947 -0.068801
C  2.297218 1.411471 -0.693636
C  2.634726 -0.525053 0.762278
C  -6.154469 -2.744675 0.824891
C  -3.710075 -0.002528 -2.984857
C  4.648862 0.538161 -0.249516
C  6.508873 1.735674 -1.323086
C  7.148036 2.580733 -0.21582
H  -3.649154 -1.257673 2.115747
H  -3.351041 0.491493 1.957157
H  -3.778172 -1.384663 -0.466011
H  -1.548459 -1.795922 0.86994
H  -1.248926 -0.833723 2.33839
H  -1.634931 0.836373 -0.030301
H  -5.933985 -1.767606 -1.123212
H  -7.260547 -1.107492 -0.107257
H  -3.945953 1.995183 -2.129387
H  -5.300979 0.888338 -1.74646
H  0.24281 2.044338 -0.974301
H  0.860017 -1.421923 1.6101
H  2.713648 2.194417 -1.3338
H  3.321923 -1.23357 1.237767
H  -6.851134 -3.52683 0.468674
H  -6.432351 -2.478277 1.859439
H  -5.137583 -3.17792 0.837389
H  -4.155223 0.284689 -3.95567
H  -3.99441 -1.052091 -2.787409
H  -2.61139 0.045543 -3.081998
H  6.962507 0.729478 -1.364579
H  6.579156 2.226349 -2.307932
H  8.217022 2.752935 -0.443049
H  7.080032 2.061958 0.754905
H  6.649025 3.5620 -0.132702
