program: Gaussian 09
title: 000258067
version: EM64L-G09RevD.01
frameworkgroup: C1[X(C21H21NO2)]
method: RPBEPBE
basis: SDD
operation: Freq
keyword: #p
keyword: freq=noraman
keyword: PBEPBE/SDD
title: #p freq=noraman PBEPBE/SDD
converged: YES YES NO NO
title: Mulliken charges:
elementType: O O N C C C C C C C C C C C C C C C C C C C C C H H H H H H H H H H H H H H H H H H H H H
charge: -0.344905 -0.255103 -0.464929 0.133007 0.504259 -0.698533 -0.745662 -0.699020 -0.409248 -0.376455 -0.336974 -0.453114 0.372714 0.157363 0.336792 0.433579 -0.336548 -0.373797 -0.468759 -0.424225 -0.234451 0.233708 -0.273220 -0.242703 0.208114 0.224028 0.214249 0.217218 0.216905 0.217687 0.208089 0.213212 0.224119 0.248717 0.230652 0.297716 0.248789 0.192169 0.298305 0.239318 0.337056 0.240153 0.228722 0.229715 0.231289
chargesum: 0.00000
title: Mulliken charges with hydrogens summed into heavy atoms:
elementType: O O N C C C C C C C C C C C C C C C C C C C C C
charge: -0.344905 -0.255103 -0.127873 0.133007 0.504259 -0.052142 -0.093852 -0.053599 -0.160530 -0.145804 -0.039258 -0.204325 0.372714 0.157363 0.336792 0.433579 -0.144380 -0.075492 -0.229441 -0.184072 -0.005728 0.233708 -0.043506 -0.011415
polarizability: 4.10842166e+02 8.97169649e+00 2.63133567e+02 4.34096964e-02 -4.82375874e-01 1.17430408e+02
1716.lowfreq: -11.0883 -9.1409 -2.9505 -0.0011 0.0003 0.0008 3.8931 18.0677 39.8424
frequency: -8.0400 17.4551 39.8385 44.6713 50.3661 62.5888 101.7045 124.2501 142.6135 166.5634 176.2872 196.6993 222.3951 246.1434 255.5121 273.5515 276.3295 311.6727 314.0507 339.0643 351.0673 362.3149 409.1151 417.0238 425.1657 430.4510 457.9495 471.2502 478.5355 510.6172 522.4590 546.5337 558.2481 594.9883 625.1492 629.8438 645.1011 664.3114 691.8045 703.5977 734.5014 739.4026 739.8335 782.4879 782.8719 807.1270 823.1638 832.1033 839.5540 850.2826 868.7975 868.9357 917.3028 923.0264 930.7929 942.9770 945.6986 951.3918 957.5639 976.0039 985.4015 992.4640 1005.7768 1020.3278 1025.3573 1030.1002 1054.1299 1091.9582 1109.7821 1120.7548 1146.3809 1155.6216 1166.1414 1183.3460 1195.6552 1205.4071 1211.1318 1217.5354 1236.4478 1271.7101 1273.0964 1289.0502 1305.4828 1364.7876 1367.7589 1374.6521 1376.0394 1403.4810 1409.0525 1410.2649 1420.4349 1443.8113 1455.3629 1459.3971 1464.8852 1467.4822 1478.1340 1486.3320 1486.8099 1495.9398 1501.9219 1540.4427 1582.7713 1591.8522 1599.6241 1616.5596 1635.9570 1677.1366 2972.0591 2972.9636 2978.0537 3066.6274 3068.1864 3070.7708 3076.3718 3078.1311 3080.4887 3110.7586 3126.1225 3130.5473 3130.9686 3144.1127 3155.3531 3158.4642 3163.6634 3164.8307 3191.8048 3205.9510 3566.4488
redmass: 3.6943 5.1778 6.9282 5.1274 3.4795 4.6754 4.4088 5.1538 4.3418 4.6297 4.0536 1.1639 3.2822 2.8835 1.1348 3.8969 5.3306 1.0465 3.5521 3.9932 2.5025 3.9080 2.9812 2.9336 4.3358 3.6669 3.0010 3.3619 4.4460 6.8891 4.8982 2.4650 2.4831 5.2415 7.2271 1.7318 3.5041 5.7417 4.0854 8.6583 3.3655 1.4861 4.0719 5.5034 2.0464 1.4188 3.7481 1.3531 3.6171 1.4762 3.3667 2.3134 1.7395 1.3592 1.6336 1.2065 8.1810 1.4032 1.3420 1.3404 1.3331 1.3615 2.8749 1.4774 1.3841 3.2373 2.5816 2.2538 2.2736 1.3859 2.3116 1.7022 1.7321 1.1141 1.2628 2.9868 1.7504 2.3902 1.8936 2.3740 2.0033 2.3999 1.2812 3.8920 2.6211 1.2851 1.1866 1.2097 3.0011 3.2084 5.5302 2.4789 2.3135 1.0508 1.0485 1.0961 1.1357 1.1712 1.5869 1.2839 1.8533 2.7647 7.2091 7.4158 5.2717 6.3555 6.1843 8.4906 1.0347 1.0347 1.0358 1.1000 1.0999 1.1006 1.0985 1.0994 1.0992 1.0865 1.0875 1.0880 1.0870 1.0937 1.0966 1.0898 1.0952 1.1003 1.0943 1.0942 1.0749
irintensity: 0.1415 0.2712 2.6090 0.3564 0.7209 1.0125 0.0281 1.7966 0.1204 0.4900 2.7469 0.2869 3.0733 0.0829 0.1756 4.8394 3.3767 0.0314 4.8372 1.7802 0.7299 3.5275 0.0117 11.0911 4.0717 0.0299 0.6089 0.1276 4.8568 0.4291 0.3000 18.8318 0.6259 6.2924 4.5832 24.5847 2.5507 4.1114 54.1254 3.7742 4.1751 22.2696 4.3844 5.6255 71.3767 71.2918 16.2578 18.2430 0.3099 50.8741 17.2252 17.3347 3.8206 2.9441 2.4699 0.4009 185.0282 1.6134 1.5259 0.9484 1.3701 4.0583 34.5817 8.3658 0.1369 59.1129 80.7371 6.6189 47.4457 34.4302 600.4535 283.8062 101.8389 12.6437 5.8040 7.3102 182.5763 47.0011 3.1162 100.2680 3.0700 5.4189 8.1310 10.7993 71.2072 25.3589 19.0253 17.4222 70.5212 3.9557 115.6804 5.9784 1.8799 0.0878 0.8133 36.9528 93.4301 136.9541 434.0323 88.6460 12.1283 371.0671 14.3326 39.3922 7.6152 3.5886 8.1317 234.7956 33.9414 32.4596 35.3966 8.0998 5.2830 10.9750 137.5368 44.5725 43.0747 20.5429 0.9161 21.7593 1.8814 31.1125 31.7651 16.3832 2.7901 29.0156 4.1049 3.4259 34.8491
temp: 298.150 k
press: 1.00000 atm
elementType: 8 8 7 6 6 6 6 6 6 6 6 6 6 6 6 6 6 6 6 6 6 6 6 6 1 1 1 1 1 1 1 1 1 1 1 1 1 1 1 1 1 1 1 1 1
symmnumber: 1
zpe: 957537.3 jmol-1
zpe.correction: 0.364707 hartree
zpe.thermalcorrener: 0.385551 hartree
zpe.thermalcorrenthalpy: 0.386495 hartree
zpe.thermalcorrgfe: 0.314317 hartree
zpe.sumelectzpe: -1016.360147 hartree
zpe.sumelectthermal: -1016.339303 hartree
zpe.sumelectthermalent: -1016.338359 hartree
zpe.sumelectthermalfe: -1016.410536 hartree
dipole: -0.0367 -2.1922 -0.0152
dipole: 2.1925
quadrupole: -112.3387 -130.8588 -149.7858
quadrupole: 1.9820 0.0075 -0.3331
quadrupole: 18.6557 0.1356 -18.7914 1.9820 0.0075 -0.3331
hfenergy: -1016.7248538 hartree
pointgroup: C01 [X(C21H21N1O2)]
dipole: -0.0258765 -0.4742274 0.7200959 debye
polarizability: 411.0281717|6.1658562|160.1166136|-4.3508297|-66.2248607|220.2613562 unknown
InChI: InChI=1S/C21H21NO2/c1-21(2,3)16-11-13-17(14-12-16)24-20(23)22-19-10-6-8-15-7-4-5-9-18(15)19/h4-14,22H,1-3H3
charge 0 multiplicity 1
45 atoms
O  0.587723 -0.171444 0.292428
O  -0.110499 1.082328 -1.613057
N  -1.60305 0.057213 -0.080483
C  6.398976 0.016728 0.133296
C  4.852157 0.00148 0.111345
C  6.887175 0.781626 1.400859
C  6.999476 0.712684 -1.115024
C  6.930928 -1.447885 0.178498
C  4.087365 0.580189 -0.93068
C  4.135587 -0.61233 1.177217
C  2.672162 0.562746 -0.935451
C  2.729992 -0.644194 1.199502
C  2.002378 -0.05445 0.141606
C  -4.045454 -0.104125 0.1256
C  -2.885161 0.38776 -0.594549
C  -5.361525 0.227692 -0.385711
C  -3.964841 -0.901253 1.317052
C  -3.043896 1.16229 -1.754691
C  -5.488618 1.020655 -1.572682
C  -6.522792 -0.247091 0.310036
C  -4.348839 1.473402 -2.23605
C  -0.363861 0.404742 -0.591192
C  -5.114864 -1.349259 1.972632
C  -6.409625 -1.019882 1.465954
H  7.992755 0.790115 1.441389
H  6.532739 1.828641 1.387821
H  6.517398 0.311346 2.329649
H  6.684083 1.770035 -1.185679
H  8.103045 0.696529 -1.05244
H  6.709478 0.19839 -2.049916
H  8.036921 -1.45186 0.206491
H  6.568073 -1.987718 1.07161
H  6.604006 -2.012596 -0.713725
H  4.589482 1.064696 -1.77291
H  4.680691 -1.074887 2.00781
H  2.109924 1.020263 -1.749911
H  2.185007 -1.117296 2.022102
H  -2.996909 -1.183779 1.748824
H  -2.16052 1.524027 -2.283685
H  -6.489964 1.262539 -1.945997
H  -1.556964 -0.504326 0.769998
H  -7.510642 0.012169 -0.088961
H  -4.442389 2.079567 -3.143399
H  -5.023966 -1.956291 2.879749
H  -7.305042 -1.375482 1.986625
