program: Gaussian 09
title: 000258022
version: EM64L-G09RevD.01
frameworkgroup: C1[X(C9H11NO)]
method: RPBEPBE
basis: SDD
operation: Freq
keyword: #p
keyword: freq=noraman
keyword: PBEPBE/SDD
title: #p freq=noraman PBEPBE/SDD
converged: YES YES NO NO
title: Mulliken charges:
elementType: O N C C C C C C C C C H H H H H H H H H H H
charge: -0.448502 -0.715380 0.396474 -0.585420 -0.573946 0.056377 0.537869 -0.347870 -0.434641 -0.032148 -0.601334 0.226097 0.247286 0.237824 0.209104 0.215671 0.226949 0.300038 0.303894 0.350567 0.211657 0.219434
chargesum: 0.00000
title: Mulliken charges with hydrogens summed into heavy atoms:
elementType: O N C C C C C C C C C
charge: -0.097935 -0.111448 0.396474 -0.112037 -0.336122 0.056377 0.537869 -0.138766 -0.218970 0.194800 -0.170243
polarizability: 1.38866464e+02 -4.69550960e+00 1.28399142e+02 -7.87976858e+00 2.14986765e+00 5.79722092e+01
1716.lowfreq: -8.3273 -0.0006 0.0005 0.0007 1.4100 11.1305 44.5082 74.3390 132.6552
frequency: 44.4637 74.3249 132.6536 150.7619 215.8757 281.5771 287.8854 297.8729 328.5341 331.5143 355.5642 382.8507 437.9129 459.3429 492.0532 541.6650 579.9987 653.3333 710.0053 731.5265 780.8596 787.3211 870.1602 894.9912 912.7664 931.9036 945.4438 953.2736 1016.5206 1034.0113 1079.8759 1119.9734 1155.8768 1169.6101 1213.1829 1231.3970 1266.5003 1288.7546 1320.9360 1330.5419 1395.0001 1425.5715 1444.2250 1464.2608 1504.9153 1604.9551 1633.1543 1644.2803 1656.3980 2975.1040 3026.4110 3078.9747 3092.6761 3105.4544 3120.2103 3136.8701 3192.6845 3574.1762 3591.1253 3715.1655
redmass: 2.6456 3.1777 3.8317 2.9163 3.2546 3.6665 1.1216 1.2554 2.2086 1.1863 5.3767 2.3833 2.7954 4.5014 3.2800 2.5380 2.6597 2.4549 3.5404 4.7573 3.7713 1.5709 1.5166 1.3882 1.5246 1.9299 1.5390 2.3812 1.1543 1.6131 2.0558 1.7539 1.1850 1.6215 1.3333 1.9264 1.4772 1.2298 1.7882 2.2396 6.2775 1.1996 1.9006 1.5221 3.2593 6.7984 1.9470 1.9872 4.7386 1.0612 1.0970 1.0669 1.0860 1.0874 1.0909 1.0959 1.1143 1.0447 1.0660 1.1041
irintensity: 0.3248 0.3975 0.1280 5.7958 14.0938 29.6803 11.4478 397.6577 7.0437 4.4556 3.1510 2.9072 12.3877 3.1483 10.3463 1.0972 6.5386 10.4705 0.7667 38.6881 10.7129 50.1422 27.1343 1.6319 10.5090 16.6184 70.7193 1.0944 19.8058 10.7303 73.3142 5.5118 113.1190 41.3271 9.7496 33.2866 21.1565 1.0151 0.5314 26.5390 30.2318 3.6027 12.7192 63.5461 166.6029 9.0475 8.1891 192.0420 18.9366 17.7523 6.3130 20.1887 8.3575 23.4688 11.4547 24.2523 30.6379 58.1861 23.0741 18.0268
temp: 298.150 k
press: 1.00000 atm
elementType: 8 7 6 6 6 6 6 6 6 6 6 1 1 1 1 1 1 1 1 1 1 1
symmnumber: 1
zpe: 467591.7 jmol-1
zpe.correction: 0.178096 hartree
zpe.thermalcorrener: 0.189377 hartree
zpe.thermalcorrenthalpy: 0.190321 hartree
zpe.thermalcorrgfe: 0.141169 hartree
zpe.sumelectzpe: -478.696979 hartree
zpe.sumelectthermal: -478.685699 hartree
zpe.sumelectthermalent: -478.684755 hartree
zpe.sumelectthermalfe: -478.733907 hartree
dipole: -2.3247 -1.1251 0.1413
dipole: 2.5865
quadrupole: -58.2897 -51.8626 -69.0636
quadrupole: -1.9073 -1.0027 0.3709
quadrupole: 1.4490 7.8760 -9.3250 -1.9073 -1.0027 0.3709
hfenergy: -478.8750756 hartree
pointgroup: C01 [X(C9H11N1O1)]
dipole: 0.9904566 -0.2057093 -0.1106166 debye
dipolederiv: -0.4551677 0.6369734 0.0779609 0.5780504 -1.0358464 -0.1282944 0.0750371 -0.1556793 -0.4299965 -0.6071933 0.6342488 0.0769358 0.7353377 -0.9949757 -0.0761505 0.0853189 -0.074512 -0.7824784 0.3138233 -0.0709636 -0.0567142 0.3410402 0.0751643 -0.0244439 -0.0844109 -0.0550881 -0.0345996 0.0494954 -0.0035162 0.0161834 -0.1455968 -0.0427231 -0.0648409 0.1011759 -0.0000274 0.103485 -0.2311788 0.388373 0.05626 -0.087151 -0.0962285 0.0207144 -0.0065546 -0.0135903 -0.2200613 0.0421076 -0.6281516 -0.0903065 -0.6088635 0.7819087 0.1551895 -0.1129955 0.1537829 0.0020734 0.4526188 -0.7314219 -0.1182816 -0.8979247 0.9463759 0.1634854 -0.1349822 0.1543015 0.1591175 0.1224748 0.2764422 0.0139312 -0.1776888 -0.0306502 0.0252631 -0.0296415 0.0054127 -0.1537142 -0.0017025 -0.1488779 -0.0334497 0.4711929 -0.2098156 -0.0248595 0.0442892 0.0138249 -0.2440054 -0.0830285 0.1691003 -0.0307422 0.3608844 0.1861202 0.0436519 0.0497198 0.1076543 0.1571241 -0.3998372 0.086945 -0.0612503 0.0471839 -0.2440247 0.0832939 -0.0543031 0.0909701 0.0836327 -0.0483521 -0.0391075 0.0610337 -0.0713568 0.0750677 0.046572 0.0522274 -0.0079121 -0.1069274 0.03315 0.0126332 -0.0249242 0.0668972 -0.0239345 0.0363243 -0.088053 0.0059139 0.0840195 0.1037697 -0.0390361 -0.0008556 -0.0664696 -0.0891186 -0.0246732 0.0154638 -0.016895 0.1472398 0.0497267 -0.059107 -0.0025076 -0.077733 -0.1367142 -0.0353951 -0.0015289 -0.0381698 0.1590338 -0.1554525 -0.0102403 0.0185484 0.0053 0.0733633 -0.0143014 0.0231527 -0.0108277 0.1697167 0.1268914 -0.0208416 0.0695567 -0.0628063 0.0617771 -0.0033972 0.0238807 -0.026165 -0.1274975 0.1512358 -0.0478972 0.0062 -0.0429761 0.1563462 -0.0283212 0.0051923 -0.0271047 0.3859494 0.1288891 -0.0347051 0.0100784 -0.0513348 0.1808891 -0.0235589 0.0109103 -0.0230151 0.382071 0.1406921 -0.2174113 -0.0035427 -0.1278099 0.2615076 -0.0014878 0.0003004 0.0136107 0.376067 0.1125086 -0.1078303 -0.0280084 -0.1479479 -0.0008746 -0.0942537 -0.0415473 -0.1033541 0.005903 0.1545291 -0.0456083 0.0438943 -0.0402276 0.1063861 -0.0305167 0.0673487 0.0068697 -0.1161529 unknown
polarizability: 135.9201142|7.8229557|130.32649|-7.4622612|8.2319568|58.9912116 unknown
InChI: InChI=1S/C9H11NO/c1-2-3-7-6-8(10)4-5-9(7)11/h2,4-6,11H,1,3,10H2
charge 0 multiplicity 1
22 atoms
O  -0.677383 2.693938 0.469257
N  2.631223 -1.828499 -0.346273
C  -0.419862 0.31084 0.120878
C  -1.938073 0.171591 0.221217
C  0.414135 -0.810272 -0.079759
C  0.187963 1.587037 0.258962
C  1.831451 -0.694394 -0.14823
C  1.591185 1.724116 0.191511
C  2.412931 0.595259 -0.010229
C  -2.517183 -0.954333 -0.610508
C  -3.307152 -1.951278 -0.137467
H  -2.225819 0.032221 1.282861
H  -2.389333 1.134259 -0.088411
H  -0.05561 -1.796574 -0.183604
H  2.053912 2.714677 0.298327
H  3.501577 0.716103 -0.060213
H  -2.275288 -0.923575 -1.684586
H  3.642237 -1.75182 -0.390175
H  2.212555 -2.747915 -0.443332
H  -0.154349 3.531637 0.51307
H  -3.72187 -2.720585 -0.798871
H  -3.566044 -2.021432 0.926773
