program: Gaussian 09
title: 000258023
version: EM64L-G09RevD.01
frameworkgroup: C1[X(C11H14BrNO)]
method: RPBEPBE
basis: SDD
operation: Freq
keyword: #p
keyword: freq=noraman
keyword: PBEPBE/SDD
title: #p freq=noraman PBEPBE/SDD
converged: NO YES NO NO
title: Mulliken charges:
elementType: Br O N C C C C C C C C C C C H H H H H H H H H H H H H H
charge: -0.012726 -0.257271 -0.432843 -0.245461 0.595459 -0.690125 -0.690138 -0.373722 -0.477478 0.613318 -0.498201 -0.334489 0.212600 -0.796782 0.214771 0.211376 0.214778 0.229741 0.229744 0.214778 0.211373 0.251384 0.238064 0.315220 0.308442 0.240441 0.267290 0.240457
chargesum: 0.00000
title: Mulliken charges with hydrogens summed into heavy atoms:
elementType: Br O N C C C C C C C C C C C
charge: -0.012726 -0.257271 -0.124400 -0.030690 0.595459 -0.034230 -0.034244 -0.122338 -0.239414 0.613318 -0.498201 -0.019269 0.212600 -0.048594
polarizability: 2.11663325e+02 -2.75017537e+00 1.62241606e+02 -5.41037533e-04 1.52076802e-03 8.06841429e+01
1716.lowfreq: -74.7360 -12.0506 -3.2083 -0.0002 0.0006 0.0006 1.6374 24.1331 58.4932
frequency: -74.7332 23.8043 58.4922 65.3256 111.8482 116.5977 122.9309 148.0742 215.5913 217.2829 244.3802 254.6296 258.8720 302.4131 357.2425 399.9464 415.3844 438.1422 461.8331 520.0441 577.7701 611.0210 623.5385 656.5137 691.9539 735.7725 746.8529 837.3463 861.6853 879.9477 893.1996 917.3201 934.2224 955.2206 986.6572 987.1346 1018.8202 1032.2804 1065.7313 1113.5177 1125.9344 1161.9200 1214.2003 1224.9388 1250.3204 1289.8492 1306.4868 1318.3329 1369.8144 1376.2297 1377.4693 1395.5432 1404.7130 1442.7808 1466.5377 1467.2427 1467.5644 1467.8730 1480.0673 1487.3352 1513.5980 1565.5260 1617.0397 1633.3009 2974.0083 2976.9734 2983.9385 2988.5253 3065.9725 3073.9218 3073.9230 3079.3104 3083.4428 3129.5554 3137.7895 3153.6456 3186.8251 3474.8436
redmass: 1.0368 2.8845 3.5805 5.8194 5.0396 3.5390 5.3872 4.3272 4.3136 1.0458 1.7468 1.9202 4.0402 4.1297 3.0132 5.4187 4.1719 3.3791 3.1613 3.2376 3.2544 3.1543 3.6820 7.1569 1.2198 3.2658 4.3040 4.4966 1.3950 1.4933 2.6565 1.1823 6.4838 1.4509 1.7306 1.3459 2.8504 1.6615 1.5251 2.5243 1.7145 1.5465 1.6532 3.2003 1.4769 2.3560 1.3290 2.0475 2.8530 1.2918 1.1944 1.2653 3.0142 1.2931 1.0465 1.0498 1.6848 1.0454 1.0519 1.1044 2.6904 4.6445 7.1338 4.9408 1.0350 1.0355 1.0842 1.0382 1.1000 1.0989 1.0985 1.1006 1.0999 1.0909 1.0982 1.0915 1.0941 1.0764
irintensity: 0.2247 0.0000 0.1630 11.1667 5.2556 0.4476 0.1788 0.4302 1.5250 0.0051 1.4380 1.4376 0.4960 1.3837 4.2112 0.6648 1.0402 9.9923 4.3106 7.2337 3.5765 15.3702 3.8730 9.7632 47.1681 21.2297 33.5637 4.8996 42.6476 10.6342 7.7351 4.4663 9.6683 0.0006 23.0444 3.6577 29.7013 8.3974 24.5734 1.5843 3.9111 0.4899 10.0795 60.7941 11.9129 62.1474 0.6872 57.5108 110.2399 82.9974 15.7275 0.7857 49.1577 89.7737 19.9639 1.3434 3.4578 4.6020 11.7882 24.1597 467.0133 61.5824 58.5060 98.3100 29.2414 34.8304 16.0631 6.8954 1.0697 84.1410 34.7844 23.9293 42.4130 15.8319 7.8761 4.0608 9.3314 51.5187
temp: 298.150 k
press: 1.00000 atm
elementType: 35 8 7 6 6 6 6 6 6 6 6 6 6 6 1 1 1 1 1 1 1 1 1 1 1 1 1 1
symmnumber: 1
zpe: 590157.5 jmol-1
zpe.correction: 0.224779 hartree
zpe.thermalcorrener: 0.239220 hartree
zpe.thermalcorrenthalpy: 0.240164 hartree
zpe.thermalcorrgfe: 0.181605 hartree
zpe.sumelectzpe: -569.984419 hartree
zpe.sumelectthermal: -569.969979 hartree
zpe.sumelectthermalent: -569.969035 hartree
zpe.sumelectthermalfe: -570.027594 hartree
dipole: 0.7989 1.8538 -0.0001
dipole: 2.0187
quadrupole: -77.5445 -101.1717 -96.4086
quadrupole: -10.8416 0.0002 0.0003
quadrupole: 14.1638 -9.4634 -4.7003 -10.8416 0.0002 0.0003
hfenergy: -570.2091986 hartree
pointgroup: C01 [X(C11H14Br1N1O1)]
dipole: 0.3853678 0.6944376 0.0009291 debye
polarizability: 210.6285475|-7.5916334|163.2762575|0.0485724|0.0914851|80.6842693 unknown
InChI: InChI=1S/C11H14BrNO/c1-7(2)9-4-5-11(10(12)6-9)13-8(3)14/h4-7,13H,1-3H3
charge 0 multiplicity 1
28 atoms
Br -0.597538 3.048416 0.003703
O  -3.320713 -1.713066 -0.00291
N  -2.336251 0.422955 -0.00009
C  3.386392 -0.692384 0.001126
C  1.882103 -0.412528 0.000783
C  4.072279 -0.141445 1.279924
C  4.073524 -0.138087 -1.275552
C  1.390222 0.919106 0.002106
C  0.933058 -1.462667 -0.000819
C  -0.954699 0.112138 0.000162
C  0.008996 1.161145 0.001782
C  -0.454687 -1.219443 -0.001134
C  -3.428403 -0.452159 -0.001631
C  -4.7795 0.263151 -0.001324
H  3.513605 -1.793651 -0.000262
H  3.98577 0.960024 1.334539
H  5.148753 -0.394251 1.280796
H  3.614841 -0.562467 2.192986
H  3.617011 -0.556733 -2.190167
H  5.150009 -0.390852 -1.276013
H  3.987044 0.963519 -1.327377
H  2.083631 1.765874 0.003407
H  1.284194 -2.501509 -0.00185
H  -1.177564 -2.037447 -0.002382
H  -2.552536 1.425485 0.000985
H  -4.893095 0.901727 0.894234
H  -5.576896 -0.493317 -0.002181
H  -4.89265 0.903268 -0.895837
