program: Gaussian 09
title: 000258137
version: EM64L-G09RevD.01
frameworkgroup: C1[X(C20H17N5)]
method: RPBEPBE
basis: SDD
operation: Freq
keyword: #pfreq=noraman
keyword: PBEPBE/SDD
title: #p freq=noraman PBEPBE/SDD
converged: YES YES NO NO
title: Mulliken charges:
elementType: N N N N N C C C C C C C C C C C C C C C C C C C C H H H H H H H H H H H H H H H H H
charge: -0.183789 0.025873 -0.060623 -0.026950 -0.019080 0.220187 -0.047288 0.137789 0.250022 -0.033857 0.297803 -0.627004 -0.370148 -0.365581 -0.381423 -0.374289 -0.348830 -0.233076 -0.213542 -0.179000 -0.240748 -0.238131 -0.232836 -0.245240 -0.683590 0.247089 0.252428 0.297859 0.253430 0.259532 0.261529 0.248039 0.258246 0.236212 0.235801 0.227602 0.226935 0.236973 0.229515 0.244494 0.228981 0.228685
chargesum: 0.00000
title: Mulliken charges with hydrogens summed into heavy atoms:
elementType: N N N N N C C C C C C C C C C C C C C C C C C C C
charge: -0.183789 0.025873 -0.060623 -0.026950 -0.019080 0.220187 -0.047288 0.137789 0.250022 -0.033857 0.297803 0.170372 -0.116718 -0.106049 -0.119894 -0.126250 -0.090585 0.003136 0.022259 -0.179000 -0.013145 -0.011196 0.004137 -0.015726 0.018570
polarizability: 5.11265619e+02 -4.29434343e+00 2.67558227e+02 -1.10034847e+00 2.20780237e+01 1.47051238e+02
1716.lowfreq: -9.5039 -3.8194 -0.0009 0.0004 0.0005 6.5257 27.7399 38.8597 41.2482
frequency: 27.7110 38.7962 41.0228 62.9920 66.5477 75.6017 91.9048 99.8012 117.7519 126.5553 179.4597 186.3099 207.4137 233.3597 238.2242 247.9158 269.7090 306.1833 326.0971 339.3185 375.2928 401.0483 404.0591 441.4670 449.1808 479.5527 493.8695 530.2898 542.5523 550.4769 589.9465 611.4023 613.0116 618.6430 647.7102 658.1064 687.5706 698.6180 703.6886 716.5017 724.4133 767.1672 772.9492 793.4570 802.2634 836.6453 849.6819 859.9042 906.4848 924.1886 926.1859 934.1452 976.8939 983.9266 988.3602 989.1189 994.9553 999.5389 1003.4522 1008.4220 1025.2892 1035.8672 1046.6952 1083.0293 1084.3081 1084.7408 1087.1549 1116.3739 1128.5074 1150.6281 1172.9817 1176.3723 1191.5953 1193.6252 1201.4788 1244.9952 1304.0305 1313.2970 1317.3011 1321.5066 1351.8725 1370.7320 1373.5680 1385.5912 1394.3570 1420.2285 1427.6004 1435.5619 1442.0257 1450.4837 1456.1610 1467.9505 1480.2560 1484.0688 1495.3073 1502.4347 1515.8420 1522.8515 1582.9112 1583.7061 1599.7929 1609.0157 1612.2704 2952.6182 3008.2209 3033.1118 3057.1287 3098.5132 3110.2080 3126.0624 3128.3379 3135.7802 3136.7446 3141.2336 3146.5844 3152.6948 3156.8576 3162.9339 3170.9538 3171.1380
redmass: 4.4280 4.2048 4.1905 4.6093 3.6576 4.0041 2.8236 1.2263 3.1256 1.3602 4.4385 4.0639 4.8347 5.6038 4.5479 6.4268 4.5015 4.3393 3.5335 5.7388 5.3509 2.8453 2.8492 5.2248 4.0930 5.0401 4.0321 6.1989 7.4310 6.3028 5.3890 5.5767 6.1824 6.4124 6.8155 7.5078 6.5053 1.8737 1.9617 3.8936 6.0490 2.2229 2.1192 8.2334 6.8498 5.0810 1.2512 1.2457 5.8825 1.4375 1.4854 1.4116 1.4012 1.4740 4.9426 5.6015 1.3398 4.5840 1.3510 4.9583 2.8157 2.0960 3.6617 1.6484 1.3546 1.6318 1.9515 1.3399 2.7742 2.3988 1.0537 1.0541 1.1507 1.1178 4.8030 3.4755 3.3437 1.6618 1.6890 1.3706 3.7523 6.4842 5.2367 4.1739 1.2920 1.5956 1.7233 2.1530 1.4896 1.1102 2.4132 1.0496 2.7506 2.1839 1.9474 2.3911 5.4547 5.4788 5.9507 6.0145 8.2033 6.0387 6.4294 1.0314 1.0349 1.0973 1.1023 1.0984 1.0924 1.0848 1.0865 1.0874 1.0889 1.1033 1.0923 1.0934 1.0967 1.0950 1.1017 1.1000
irintensity: 0.1312 0.0286 0.3192 0.1178 0.0629 0.2715 0.8216 0.4228 6.5535 2.7775 0.8064 4.5042 4.2693 1.9016 3.6201 0.8614 1.1678 5.3816 1.4025 1.3523 2.6749 0.7176 0.3304 3.1204 0.3928 3.4070 13.5570 4.8536 5.8822 9.3963 19.2840 9.5105 4.3755 2.0270 5.2601 0.2945 6.6824 42.1210 53.3005 11.5858 11.0912 67.1501 14.2167 5.0782 5.3811 12.0655 0.5790 0.5303 22.6097 0.4706 13.3302 3.0290 1.0638 0.0416 1.3185 0.2232 0.8879 47.3958 1.6600 29.2168 3.6850 1.0601 10.4785 4.2556 1.3261 12.0190 11.8549 2.2627 2.8050 8.3371 0.3385 0.0591 6.8028 2.2256 39.2389 32.6168 74.5974 12.9002 12.8562 5.1241 8.9149 0.3635 7.5188 6.9112 35.6321 137.0835 41.5843 23.6369 23.2732 27.9188 63.2268 12.7390 102.6697 20.4527 36.0650 147.4798 31.4991 97.0142 2.2539 6.9045 67.0750 4.5600 4.2352 128.3338 28.2625 25.8407 23.7927 6.7973 16.7738 1.0986 2.7536 0.0765 9.8099 2.2336 10.7677 33.4989 21.3300 21.1869 24.6845 13.5989
temp: 298.150 k
press: 1.00000 atm
elementType: 7 7 7 7 7 6 6 6 6 6 6 6 6 6 6 6 6 6 6 6 6 6 6 6 6 1 1 1 1 1 1 1 1 1 1 1 1 1 1 1 1 1
symmnumber: 1
zpe: 853363.9 jmol-1
zpe.correction: 0.325029 hartree
zpe.thermalcorrener: 0.346134 hartree
zpe.thermalcorrenthalpy: 0.347078 hartree
zpe.thermalcorrgfe: 0.273853 hartree
zpe.sumelectzpe: -1044.321960 hartree
zpe.sumelectthermal: -1044.300855 hartree
zpe.sumelectthermalent: -1044.299911 hartree
zpe.sumelectthermalfe: -1044.373136 hartree
dipole: -6.8931 -1.8017 0.5092
dipole: 7.1429
quadrupole: -152.1270 -137.3552 -140.5301
quadrupole: 12.3866 0.7181 4.9733
quadrupole: -8.7895 5.9822 2.8073 12.3866 0.7181 4.9733
hfenergy: -1044.6469892 hartree
pointgroup: C01 [X(C20H17N5)]
dipole: -2.7237463 -0.6900209 0.0491152 debye
polarizability: 511.0723731|-8.3605608|255.2495912|0.5536609|42.855885|159.5531194 unknown
InChI: InChI=1S/C20H17N5/c1-21-20-22-13-16-19(24-20)25(2)18(15-11-7-4-8-12-15)17(23-16)14-9-5-3-6-10-14/h3-13H,1-2H3
charge 0 multiplicity 1
42 atoms
N  0.881549 -1.17009 -0.175261
N  0.670995 1.597244 0.381825
N  3.252155 -0.975995 -0.216001
N  4.307008 1.217437 0.350372
N  5.585939 -0.756978 -0.204492
C  -0.377749 -0.566448 -0.086444
C  -0.470887 0.830605 0.153586
C  2.07262 -0.394441 -0.065941
C  -1.576727 -1.45266 -0.181897
C  1.868647 1.007495 0.270078
C  -1.751586 1.596208 0.192936
C  1.064398 -2.636096 -0.319719
C  -1.869977 -2.172664 -1.370691
C  -2.447938 -1.572938 0.93213
C  -1.856085 2.688266 1.098446
C  -2.845611 1.329321 -0.674742
C  3.107232 1.751204 0.48332
C  -3.018556 -2.989356 -1.44555
C  -3.590495 -2.39816 0.858582
C  4.416386 -0.177905 -0.027824
C  -3.029755 3.467259 1.159288
C  -4.016992 2.114123 -0.617548
C  -3.881109 -3.107014 -0.330146
C  -4.120041 3.181472 0.304141
C  6.825691 0.012562 -0.024648
H  1.078262 -2.925859 -1.384595
H  0.253464 -3.168267 0.197084
H  2.049805 -2.884115 0.103407
H  -1.212056 -2.077383 -2.242227
H  -2.23118 -1.013216 1.848044
H  -0.999829 2.921263 1.738689
H  -2.780831 0.521773 -1.409636
H  3.023505 2.809049 0.765725
H  -3.240136 -3.53058 -2.371641
H  -4.254081 -2.483355 1.725602
H  -3.092397 4.299458 1.869333
H  -4.846061 1.896675 -1.300185
H  -4.771118 -3.742952 -0.388209
H  -5.031587 3.787891 0.34799
H  6.67949 1.069715 0.26512
H  7.401939 -0.03544 -0.969506
H  7.441903 -0.499606 0.740107
