program: Gaussian 09
title: 000258054
version: EM64L-G09RevD.01
frameworkgroup: C1[X(C24H26ClN3O2)]
method: RPBEPBE
basis: SDD
operation: Freq
keyword: #p
keyword: freq=noraman
keyword: PBEPBE/SDD
title: #p freq=noraman PBEPBE/SDD
converged: YES YES NO NO
title: Mulliken charges:
elementType: Cl O O N N N C C C C C C C C C C C C C C C C C C C C C C C C H H H H H H H H H H H H H H H H H H H H H H H H H H
charge: -0.067313 -0.309227 -0.267438 -0.077175 -0.165248 -0.467445 -0.360703 -0.364621 -0.425459 -0.404062 -0.329749 -0.395491 0.533279 -0.292291 -0.297960 -0.341547 -0.221414 -0.242303 -0.247673 0.247874 0.340365 0.158094 0.433185 -0.386532 -0.337527 -0.469983 -0.424525 -0.232530 -0.273459 -0.243086 0.192222 0.209588 0.207113 0.198648 0.202918 0.228450 0.231168 0.213569 0.182418 0.199504 0.223397 0.238831 0.230413 0.221508 0.248780 0.251221 0.226194 0.233000 0.333953 0.299548 0.193039 0.238774 0.239712 0.227887 0.229322 0.230786
chargesum: 0.00000
title: Mulliken charges with hydrogens summed into heavy atoms:
elementType: Cl O O N N N C C C C C C C C C C C C C C C C C C C C C C C C
charge: -0.067313 -0.309227 -0.267438 -0.077175 -0.165248 -0.133492 0.041108 0.041140 0.005908 0.040676 0.052174 0.066737 0.533279 0.159631 -0.297960 -0.092767 0.029807 -0.016109 -0.014673 0.247874 0.340365 0.158094 0.433185 -0.086984 -0.144488 -0.231209 -0.184813 -0.004643 -0.044137 -0.012300
polarizability: 4.19705061e+02 2.57779298e+01 2.67459065e+02 -3.60316320e+01 1.33150402e+01 2.47188413e+02
1716.lowfreq: -4.5179 -3.0102 -0.0010 -0.0007 0.0006 6.9220 10.0828 11.0800 15.7232
frequency: 9.3990 10.9346 15.4473 25.3714 40.1695 55.0590 60.0820 64.9743 84.2881 89.4737 101.5495 116.9612 137.2133 168.7388 172.8987 177.6957 184.0092 227.1264 235.6773 251.7607 267.1656 275.5199 287.7483 304.2638 314.5035 320.2021 367.1343 399.1716 407.3556 418.3515 422.4681 446.6219 464.9086 471.7812 475.3572 494.4916 508.9819 518.4416 545.2290 550.9022 556.8006 616.9245 624.2042 630.0771 646.2244 656.7048 660.9104 699.9252 711.1616 731.5852 739.5039 743.1522 751.9208 771.0315 772.9488 782.7865 782.8733 807.6585 840.2405 849.4158 859.4962 869.6597 871.1944 903.5404 923.1398 923.6370 927.9968 951.6149 952.7815 969.9603 980.2555 984.9410 991.9032 1003.6140 1011.0911 1033.9173 1041.3170 1049.3831 1057.2682 1059.9715 1066.8472 1071.3900 1087.6151 1095.8894 1117.5589 1122.9228 1139.4630 1152.2705 1152.7013 1163.1802 1171.0952 1182.8743 1185.3227 1196.1454 1202.4379 1217.2548 1236.6931 1236.8552 1253.3760 1272.3699 1273.3098 1282.6018 1288.7210 1289.9560 1291.7208 1308.1748 1339.5534 1343.9870 1359.2076 1362.6258 1365.7338 1372.3401 1376.0472 1379.0210 1396.0561 1409.7193 1421.3020 1428.0520 1444.6609 1453.4063 1454.2865 1455.8537 1456.4925 1458.9152 1464.7486 1471.9145 1480.8527 1485.9452 1495.9753 1542.5390 1559.0076 1592.5392 1599.5976 1606.0764 1635.6834 1667.2790 2839.8556 2861.6559 2876.5095 2903.2175 2923.2728 2999.1322 3007.2009 3018.6418 3032.3591 3049.2435 3055.2137 3067.3529 3098.2234 3101.9090 3110.4010 3125.4824 3130.0445 3132.9624 3143.4753 3150.4311 3154.3522 3160.3707 3164.1260 3174.5430 3189.5883 3564.9659
redmass: 6.2238 5.1460 6.8221 6.0097 5.4759 6.3623 4.9078 3.9971 3.5651 2.5081 4.9750 4.0607 4.2340 4.7179 4.4937 4.0741 3.4042 5.2197 5.2706 3.3294 3.7884 4.4469 2.8095 4.1268 3.7501 2.6471 4.6007 2.2312 6.1673 2.9733 4.4109 3.3766 3.1844 3.3611 4.0921 3.9527 6.9151 5.8471 4.8018 3.6584 2.3372 3.5755 1.7159 3.6435 3.3662 4.0923 5.2617 6.3087 3.7217 4.1518 1.2925 4.9981 1.3356 1.1274 3.7286 4.1882 2.2705 1.4369 1.4395 1.5061 2.6895 1.8629 1.7323 5.8988 1.3628 3.9448 1.3822 1.4028 2.1544 1.3226 6.2322 1.3328 1.3620 3.5511 4.6099 2.8891 2.3957 2.0026 2.7222 2.4102 2.1158 3.1792 2.0526 2.3733 1.9959 2.1150 2.5953 1.8518 2.2680 2.0944 1.1153 1.1375 1.8819 1.2962 1.1345 1.4520 1.5306 1.8239 1.2623 1.4528 1.6519 1.3070 1.3004 2.1483 1.1561 1.3422 1.3088 1.5786 1.6732 1.8892 2.0920 1.7562 1.6299 1.4653 1.4402 2.8722 5.5621 2.4499 2.4741 1.0834 1.2311 1.8775 1.0953 1.1590 1.1070 1.0894 2.5140 1.1018 2.5956 2.7403 5.9125 7.3940 5.2588 6.8294 6.2286 7.3287 1.0705 1.0706 1.0691 1.0686 1.0710 1.0857 1.0605 1.0582 1.0900 1.0900 1.0903 1.1028 1.1082 1.0899 1.0866 1.0876 1.0869 1.0856 1.0937 1.0892 1.0965 1.0942 1.1003 1.1004 1.0944 1.0749
irintensity: 0.0254 0.2248 0.1387 0.2065 2.5263 0.5117 0.3843 2.8133 1.0408 0.9042 1.6211 0.4196 1.2558 0.6252 0.0531 2.8067 2.4670 3.2520 2.5644 2.0089 3.2309 6.8083 8.3337 14.0250 7.4076 9.0687 8.1463 4.2375 3.6156 10.0245 3.1733 7.7836 7.5146 0.1132 1.2585 5.5698 0.2408 2.7954 3.5713 3.7580 0.0099 7.6397 27.5527 7.8815 4.6134 22.5922 11.1305 42.7141 2.8353 7.8096 24.3716 4.4755 82.4034 5.0637 10.0211 17.0930 59.1264 73.2194 0.3588 2.2892 10.0329 16.9698 2.4269 6.3016 2.0132 34.7365 2.4214 1.8204 6.5287 0.9183 242.4261 1.3248 3.8997 14.5849 54.7837 46.4032 27.4296 1.0692 25.5325 57.7322 37.2585 38.3995 4.2563 40.5336 12.3104 8.3821 101.2730 159.2736 18.7105 276.6734 0.5234 8.6981 0.3585 2.3744 1.8892 22.3578 73.8921 12.7926 29.8613 14.0973 18.9544 16.1355 9.9445 26.2690 1.7710 26.7888 14.4766 1.8479 16.0002 16.7851 58.1597 13.7672 19.6454 51.7474 9.1420 32.9249 84.2843 11.2926 2.1696 2.6547 10.3509 5.3142 4.0189 95.1645 4.1214 1.9512 120.0349 7.7433 387.7021 449.0662 2.0379 48.1045 9.8995 82.3777 10.0274 246.3105 67.4942 57.6092 90.2879 72.9485 95.4540 18.6451 2.2917 57.0486 50.0102 45.6751 22.1129 6.9029 31.4370 6.4169 18.8055 0.8572 1.9788 5.8257 30.6918 9.0533 32.0168 17.3832 28.7892 15.0723 4.0366 32.3193
temp: 298.150 k
press: 1.00000 atm
elementType: 17 8 8 7 7 7 6 6 6 6 6 6 6 6 6 6 6 6 6 6 6 6 6 6 6 6 6 6 6 6 1 1 1 1 1 1 1 1 1 1 1 1 1 1 1 1 1 1 1 1 1 1 1 1 1 1
symmnumber: 1
zpe: 1191509.6 jmol-1
zpe.correction: 0.453822 hartree
zpe.thermalcorrener: 0.480951 hartree
zpe.thermalcorrenthalpy: 0.481895 hartree
zpe.thermalcorrgfe: 0.391176 hartree
zpe.sumelectzpe: -1702.744188 hartree
zpe.sumelectthermal: -1702.717059 hartree
zpe.sumelectthermalent: -1702.716115 hartree
zpe.sumelectthermalfe: -1702.806833 hartree
dipole: 1.5555 0.3440 -2.4645
dipole: 2.9346
quadrupole: -175.5804 -172.3646 -183.8579
quadrupole: -1.8808 -4.4737 4.6615
quadrupole: 1.6873 4.9030 -6.5903 -1.8808 -4.4737 4.6615
hfenergy: -1703.1980096 hartree
pointgroup: C01 [X(C24H26Cl1N3O2)]
dipole: 0.5647555 -0.7513924 0.6704112 debye
polarizability: 414.4892893|-51.6382648|251.0442615|14.110304|11.1686947|268.8189882 unknown
InChI: InChI=1S/C24H26ClN3O2/c25-21-10-3-4-12-23(21)28-16-14-27(15-17-28)13-6-18-30-24(29)26-22-11-5-8-19-7-1-2-9-20(19)22/h1-5,7-12,26H,6,13-18H2
charge 0 multiplicity 1
56 atoms
Cl -7.813211 1.979779 0.139869
O  2.188186 1.302818 1.621098
O  2.429466 1.699733 -0.693111
N  -2.773334 0.914767 1.080578
N  -5.31529 0.051699 -0.00783
N  4.011089 0.473433 0.592922
C  -2.905006 0.489224 -0.33516
C  -4.052068 1.510335 1.549093
C  -4.048764 -0.528872 -0.500875
C  -5.193827 0.493863 1.406801
C  -1.620614 1.81939 1.311671
C  -0.261939 1.0911 1.216765
C  -6.539014 -0.491373 -0.467284
C  0.891167 2.029496 1.598571
C  -7.769545 0.2343 -0.432141
C  -6.605628 -1.796121 -1.048991
C  -8.983454 -0.301581 -0.894454
C  -7.81084 -2.335629 -1.541525
C  -9.013052 -1.599365 -1.455086
C  2.850879 1.199653 0.37948
C  5.00928 0.11688 -0.351864
C  6.129814 -0.677282 0.11744
C  7.158582 -1.044098 -0.836844
C  4.931136 0.51148 -1.69698
C  6.277619 -1.121132 1.475076
C  7.048972 -0.62498 -2.202983
C  8.276299 -1.826947 -0.39409
C  5.954886 0.135395 -2.61471
C  7.378381 -1.88318 1.876005
C  8.390836 -2.240993 0.93325
H  -3.104274 1.364564 -1.004546
H  -1.963735 0.014843 -0.664066
H  -3.942659 1.785875 2.614666
H  -4.318898 2.431945 0.973658
H  -3.780599 -1.460258 0.051677
H  -4.155822 -0.774511 -1.572044
H  -6.138678 0.947319 1.739955
H  -4.975303 -0.385424 2.055159
H  -1.630593 2.691419 0.606084
H  -1.730715 2.234178 2.333561
H  -0.279092 0.221018 1.898105
H  -0.085779 0.718168 0.191628
H  0.971266 2.874476 0.890179
H  0.786359 2.408246 2.629218
H  -5.693987 -2.399947 -1.090117
H  -9.891793 0.306376 -0.842929
H  -7.811535 -3.341044 -1.976869
H  -9.956335 -2.01275 -1.82525
H  4.137388 0.17472 1.560275
H  4.08058 1.108373 -2.031395
H  5.528506 -0.876581 2.238224
H  7.834177 -0.910804 -2.911819
H  9.045977 -2.096183 -1.127189
H  5.868235 0.45748 -3.657993
H  7.465926 -2.208859 2.918107
H  9.249875 -2.83823 1.257032
