program: Gaussian 09
title: 000258037
version: EM64L-G09RevD.01
frameworkgroup: C1[X(C17H18N2O2)]
method: RPBEPBE
basis: SDD
operation: Freq
keyword: #p
keyword: freq=noraman
keyword: PBEPBE/SDD
title: #p freq=noraman PBEPBE/SDD
converged: YES YES NO NO
title: Mulliken charges:
elementType: O O N N C C C C C C C C C C C C C C C C C H H H H H H H H H H H H H H H H H H
charge: -0.251850 -0.257819 -0.460274 -0.457158 -0.722429 0.557588 0.558999 -0.495054 -0.576479 -0.487750 -0.407676 0.479876 0.487614 -0.198022 -0.197972 -0.473911 -0.479163 0.216092 0.220419 -0.782154 -0.782340 0.236828 0.224209 0.316753 0.310575 0.238118 0.244569 0.224009 0.221948 0.218752 0.218003 0.300557 0.300709 0.211372 0.258402 0.257815 0.211330 0.256642 0.258873
chargesum: 0.00000
title: Mulliken charges with hydrogens summed into heavy atoms:
elementType: O O N N C C C C C C C C C C C C C C C C C
charge: -0.251850 -0.257819 -0.159717 -0.156449 -0.261392 0.557588 0.558999 -0.178301 -0.265904 -0.249632 -0.163106 0.479876 0.487614 0.025987 0.023975 -0.255159 -0.261160 0.216092 0.220419 -0.054566 -0.055495
polarizability: 2.66018357e+02 -3.19315578e+01 2.08638476e+02 1.23979519e+01 2.13288010e+00 1.61888500e+02
1716.lowfreq: -2.2141 -0.0005 -0.0001 0.0007 2.3322 6.2992 11.4807 14.0445 42.8056
frequency: 11.4324 13.3155 42.7926 56.1575 57.9338 61.0339 63.5383 96.5545 99.2273 113.1674 131.8619 198.5520 221.3126 252.4768 260.6202 262.0425 292.4845 330.1590 333.6235 373.8346 386.6882 438.5677 443.7494 515.6694 516.9125 525.4532 553.5251 562.6169 593.2987 608.1271 636.7972 643.9478 651.4247 653.1135 662.9729 701.1481 704.6602 756.7547 766.3790 792.4857 808.8260 877.7194 892.8427 908.7008 926.0623 929.0026 937.2657 950.9253 958.7422 970.3071 970.8101 975.7649 985.8419 986.2488 1004.2894 1006.8995 1039.3478 1039.5521 1098.1653 1101.1561 1156.5603 1171.6023 1181.9559 1182.2474 1187.7203 1229.4756 1233.0987 1268.4465 1271.9450 1285.9598 1309.1918 1327.7948 1387.2871 1387.4456 1387.7942 1390.8353 1428.4727 1433.6589 1448.7564 1449.4505 1460.7600 1468.1807 1469.5226 1470.7385 1475.7262 1516.7096 1520.3604 1599.1044 1602.5575 1615.6440 1619.1499 1625.3628 1627.2465 2977.8908 2993.0643 2994.2410 3029.3569 3093.0760 3095.5513 3098.8287 3099.7990 3108.6046 3108.9892 3126.2262 3132.3270 3153.9388 3155.1029 3176.3137 3178.5324 3533.6773 3534.4913
redmass: 5.4582 5.1632 4.3182 1.1822 4.6433 1.6056 2.4110 2.9468 2.9209 5.2784 4.4088 3.9031 4.5067 4.7750 3.7555 3.7371 3.1386 4.4238 4.7639 4.2532 3.2232 3.2048 2.9678 4.0126 4.0127 3.7742 3.7573 4.2664 3.4903 3.1486 1.2434 1.2587 4.8728 5.7475 4.2064 1.9619 2.1174 3.0772 4.7924 1.6077 1.9494 1.4901 1.4817 2.2586 4.1060 2.4453 2.5842 1.8591 1.9483 1.3629 1.4620 1.6545 5.5037 5.7732 1.7329 1.7841 1.6327 1.6321 1.6834 1.6707 1.7889 1.8058 1.0893 1.0908 1.1244 3.0557 2.6073 1.8469 2.0950 1.7244 1.3891 1.5295 3.4374 1.4451 1.2272 7.2203 2.9289 3.0293 1.0457 1.0470 1.1917 1.2856 1.1883 1.6722 2.0179 2.2138 2.1703 6.3413 6.4056 6.0017 6.7924 4.5803 4.7834 1.0610 1.0365 1.0362 1.0992 1.0999 1.1003 1.0981 1.0984 1.0884 1.0883 1.0899 1.0896 1.0986 1.0986 1.0929 1.0930 1.0764 1.0764
irintensity: 0.1390 2.0790 7.1341 1.1091 10.9646 0.9269 3.3996 0.0118 0.2572 2.6349 4.4287 5.9150 1.8047 3.2378 0.9939 1.5743 0.4834 1.3961 1.5747 0.1145 1.5823 4.2292 10.1688 18.1437 18.3221 4.4544 8.5017 1.3829 0.0205 0.6719 38.7739 45.1816 5.1936 1.5456 2.1306 39.5515 34.9408 26.9637 3.6015 79.1629 26.1895 1.7375 0.9376 2.5931 11.0725 3.7419 11.2540 16.5938 6.6138 0.4894 1.0916 3.2337 0.3086 0.7044 26.0626 24.7073 14.1816 14.1323 20.4673 5.2963 1.7224 4.5316 2.1581 1.9882 6.6517 81.2090 70.6985 16.7935 9.2814 29.4011 14.3832 22.2722 53.1240 86.9960 61.5083 29.6665 240.0307 125.2479 15.2741 15.0787 28.1070 6.0640 18.4927 25.7196 23.5317 222.4403 294.0311 132.9397 57.1148 82.8767 29.9564 99.9035 110.2742 23.5295 15.4459 15.3513 9.1320 17.7487 19.9956 8.1373 9.3337 15.9302 12.4665 18.8486 15.2597 27.1190 21.9494 7.5200 6.2838 11.0272 10.9473
temp: 298.150 k
press: 1.00000 atm
elementType: 8 8 7 7 6 6 6 6 6 6 6 6 6 6 6 6 6 6 6 6 6 1 1 1 1 1 1 1 1 1 1 1 1 1 1 1 1 1 1
symmnumber: 1
zpe: 822645.9 jmol-1
zpe.correction: 0.313329 hartree
zpe.thermalcorrener: 0.333504 hartree
zpe.thermalcorrenthalpy: 0.334448 hartree
zpe.thermalcorrgfe: 0.260453 hartree
zpe.sumelectzpe: -917.098863 hartree
zpe.sumelectthermal: -917.078688 hartree
zpe.sumelectthermalent: -917.077744 hartree
zpe.sumelectthermalfe: -917.151739 hartree
dipole: 2.0545 -0.1433 3.7902
dipole: 4.3136
quadrupole: -76.7717 -118.8082 -125.8173
quadrupole: -1.3172 -10.1553 4.4214
quadrupole: 30.3607 -11.6758 -18.6849 -1.3172 -10.1553 4.4214
hfenergy: -917.4121923 hartree
pointgroup: C01 [X(C17H18N2O2)]
dipole: -0.6058435 -0.510995 -1.5006814 debye
polarizability: 249.879397|43.1675818|220.0506723|14.4323655|-6.8303642|166.6152635 unknown
InChI: InChI=1S/C17H18N2O2/c1-12(20)18-16-7-3-5-14(10-16)9-15-6-4-8-17(11-15)19-13(2)21/h3-8,10-11,18-19H,9H2,1-2H3
charge 0 multiplicity 1
39 atoms
O  -2.513154 2.278847 -0.723551
O  3.810459 1.949617 2.004904
N  -4.057014 0.507161 -0.707404
N  4.159442 1.267322 -0.217217
C  0.144529 -1.308262 1.424743
C  -1.297228 -1.478956 0.953296
C  1.150136 -0.959029 0.324611
C  -1.96989 -0.39434 0.336359
C  2.156275 0.001482 0.582938
C  -1.974872 -2.707727 1.14287
C  1.110837 -1.615993 -0.931026
C  -3.315075 -0.540856 -0.085201
C  3.12421 0.304356 -0.409767
C  -3.31642 -2.853473 0.719449
C  2.074731 -1.313303 -1.916807
C  -3.988376 -1.779169 0.108377
C  3.080812 -0.359936 -1.6643
C  -3.660694 1.816362 -0.991113
C  4.457211 2.022996 0.918268
C  -4.736633 2.674524 -1.657246
C  5.648594 2.967569 0.757619
H  0.189562 -0.520726 2.201385
H  0.468955 -2.246456 1.91789
H  -1.462181 0.559753 0.177288
H  2.202169 0.522502 1.542084
H  -1.456422 -3.547104 1.620961
H  0.323383 -2.349247 -1.137116
H  -3.838779 -3.805094 0.867116
H  2.0434 -1.819594 -2.888018
H  -5.030619 -1.895703 -0.217035
H  3.825749 -0.127125 -2.436725
H  -5.01304 0.260805 -0.972435
H  4.763057 1.418991 -1.028132
H  -5.670964 2.131509 -1.884084
H  -4.330194 3.09074 -2.594689
H  -4.973647 3.527227 -0.997352
H  6.117054 2.937123 -0.241816
H  6.410317 2.714399 1.515146
H  5.315221 3.999514 0.962026
