program: Gaussian 09
title: 000258013
version: EM64L-G09RevD.01
frameworkgroup: C1[X(C16H15ClO)]
method: RPBEPBE
basis: SDD
operation: Freq
keyword: #p
keyword: freq=noraman
keyword: PBEPBE/SDD
title: #p freq=noraman PBEPBE/SDD
converged: YES YES NO NO
title: Mulliken charges:
elementType: Cl O C C C C C C C C C C C C C C C C H H H H H H H H H H H H H H H
charge: -0.064677 -0.267697 0.348938 0.440647 -0.379799 0.516622 -0.336350 -0.372544 -0.424864 -0.331830 -0.179097 -0.322138 -0.808864 -0.367320 -0.398045 -0.102926 -0.215977 -0.237255 0.213609 0.217473 0.245634 0.248005 0.226697 0.229615 0.237642 0.224494 0.228448 0.222599 0.228700 0.256110 0.232199 0.233009 0.258942
chargesum: 0.00000
title: Mulliken charges with hydrogens summed into heavy atoms:
elementType: Cl O C C C C C C C C C C C C C C C C
charge: -0.064677 -0.267697 0.348938 0.440647 0.051283 0.516622 -0.090716 -0.124539 -0.198167 -0.102215 0.058545 -0.097643 -0.129117 -0.111210 -0.165846 -0.102926 0.017032 0.021687
polarizability: 3.38660975e+02 -1.43875224e+00 1.63624620e+02 7.91487172e+00 8.84387517e+00 1.02921505e+02
1716.lowfreq: -11.0882 -5.1809 -2.6128 -0.0013 -0.0011 0.0012 12.9382 23.2160 33.2666
frequency: 12.3474 23.2002 33.2335 45.1609 66.7937 84.3758 123.6112 151.4495 152.0738 179.3513 185.9804 258.7587 281.0360 321.9173 329.7381 369.3057 378.6417 414.0544 428.4931 438.3475 457.3910 507.7052 531.0035 562.6071 624.7410 634.3267 683.1370 686.9185 710.9185 731.0781 787.8776 806.4534 812.0286 828.5706 835.8100 864.0872 895.2821 904.9648 929.3244 956.2666 963.0016 976.2332 982.5703 984.9643 986.8664 991.3230 1005.3072 1046.6399 1074.3356 1093.5604 1120.7719 1123.2161 1177.6519 1179.2593 1193.9050 1212.0199 1221.4862 1223.3927 1285.7623 1294.8387 1305.2558 1318.6758 1354.6048 1373.3343 1385.1335 1398.6887 1414.0880 1419.5759 1467.1164 1470.4380 1471.4662 1477.3894 1501.5710 1568.3630 1585.6454 1606.7207 1625.7295 1674.8733 2931.3330 2973.4113 3001.1509 3049.8504 3080.7966 3086.1521 3122.2490 3124.4975 3125.2891 3138.6731 3151.0155 3158.7510 3158.8079 3163.8425 3176.9445
redmass: 4.9347 5.0043 4.5857 1.0902 4.0179 4.0131 5.0173 3.3126 3.8930 4.6399 3.6782 4.1180 3.5145 3.4422 3.9521 3.6390 9.1909 2.9454 4.8356 3.1604 4.0326 2.4756 4.8627 4.8339 5.1298 6.6499 2.8202 3.4733 3.0108 4.3921 1.4717 1.4582 4.2725 1.3778 1.8367 3.6581 1.5268 1.5413 1.3291 6.0451 1.3477 1.2970 5.4656 1.4105 1.2445 1.8501 2.6139 1.5279 2.1221 1.6894 1.2666 2.3593 1.3844 1.1031 1.0908 2.0631 2.1359 3.7018 1.2542 1.6232 1.2954 1.2735 1.6815 3.9792 4.2363 1.2502 3.5180 2.6862 1.1220 1.0458 2.4586 1.0973 2.5594 6.1857 6.4423 6.5970 6.4253 6.1231 1.0582 1.0372 1.1023 1.0977 1.0983 1.0907 1.0893 1.0890 1.0899 1.0866 1.0924 1.0938 1.0940 1.0954 1.0979
irintensity: 0.4018 0.6374 0.3030 0.6651 0.7886 2.1320 0.2326 2.4754 1.7390 0.3430 0.7159 1.1920 2.6532 1.7777 3.3162 2.3774 7.8664 0.0191 1.1169 3.2767 0.4153 21.0882 12.3696 2.5485 0.0733 0.5820 25.9509 30.2008 0.7554 21.5469 55.1412 40.1640 11.2195 27.9864 12.3889 8.9871 10.1753 1.2312 0.8948 176.7904 0.6279 11.5275 7.1861 11.4356 35.0305 3.5679 7.4571 11.0748 23.7600 16.9182 15.8221 2.5589 157.8172 1.0863 18.1887 258.3845 6.4980 46.3738 0.6724 8.1055 2.5765 1.0706 25.8129 15.7627 18.2926 11.7447 4.0668 13.7706 30.0807 12.0890 38.6032 12.6847 173.6364 60.9418 23.4247 32.2271 41.9829 1.9480 33.8587 53.8136 29.3160 24.1697 20.2740 17.4965 17.3603 37.2015 13.5393 4.0564 4.4966 5.3480 26.2089 3.4852 6.4212
temp: 298.150 k
press: 1.00000 atm
elementType: 17 8 6 6 6 6 6 6 6 6 6 6 6 6 6 6 6 6 1 1 1 1 1 1 1 1 1 1 1 1 1 1 1
symmnumber: 1
zpe: 682032.3 jmol-1
zpe.correction: 0.259772 hartree
zpe.thermalcorrener: 0.276930 hartree
zpe.thermalcorrenthalpy: 0.277874 hartree
zpe.thermalcorrgfe: 0.210875 hartree
zpe.sumelectzpe: -1152.682870 hartree
zpe.sumelectthermal: -1152.665713 hartree
zpe.sumelectthermalent: -1152.664768 hartree
zpe.sumelectthermalfe: -1152.731767 hartree
dipole: -1.4912 0.4928 -1.4156
dipole: 2.1143
quadrupole: -111.9619 -104.8013 -115.8751
quadrupole: 11.4324 -1.5302 2.4329
quadrupole: -1.0825 6.0781 -4.9956 11.4324 -1.5302 2.4329
hfenergy: -1152.9426427 hartree
pointgroup: C01 [X(C16H15Cl1O1)]
dipole: 0.5496097 -0.1270943 0.6113476 debye
polarizability: 336.6928829|0.3357043|153.4282116|22.1858152|24.6091318|115.0860057 unknown
InChI: InChI=1S/C16H15ClO/c1-13-7-9-16(10-8-13)18-11-3-5-14-4-2-6-15(17)12-14/h2-10,12H,11H2,1H3
charge 0 multiplicity 1
33 atoms
Cl -6.67434 -1.104573 -2.068749
O  1.618293 0.595841 -0.018056
C  3.000368 0.327807 -0.075692
C  5.834219 0.021101 -0.235323
C  0.719646 -0.549157 0.243947
C  -3.141376 -0.039478 -0.22973
C  3.579786 -0.958126 0.039794
C  3.829393 1.460683 -0.27148
C  4.986972 -1.094353 -0.041277
C  5.224382 1.301716 -0.349206
C  -0.673242 -0.002818 0.372108
C  -1.737228 -0.487678 -0.326647
C  7.343406 -0.131611 -0.322597
C  -4.110428 -0.676255 -1.056063
C  -3.57376 0.99947 0.644058
C  -5.454315 -0.270529 -0.994945
C  -4.926792 1.387324 0.685445
C  -5.891547 0.755047 -0.136807
H  1.040575 -1.040931 1.188926
H  0.788665 -1.289356 -0.579393
H  2.96343 -1.850522 0.184805
H  3.360117 2.445478 -0.360172
H  5.427434 -2.094847 0.048274
H  5.854669 2.186799 -0.501048
H  -0.785176 0.820246 1.089442
H  -1.552677 -1.299584 -1.046383
H  7.85526 0.444337 0.471689
H  7.649465 -1.187176 -0.219665
H  7.731851 0.236479 -1.2912
H  -3.809022 -1.47796 -1.738541
H  -2.851383 1.506985 1.291248
H  -5.245837 2.18862 1.360492
H  -6.943607 1.051718 -0.108462
