program: Gaussian 09
title: 000258007
version: EM64L-G09RevD.01
frameworkgroup: C1[X(C15H13NO3)]
method: RPBEPBE
basis: SDD
operation: Freq
keyword: #p
keyword: freq=noraman
keyword: PBEPBE/SDD
title: #p freq=noraman PBEPBE/SDD
converged: YES YES NO NO
title: Mulliken charges:
elementType: O O O N C C C C C C C C C C C C C C C H H H H H H H H H H H H H
charge: -0.271794 -0.203505 -0.204963 0.022341 0.540418 -0.521308 -0.323894 0.365288 -0.379409 -0.395397 -0.174470 -0.368007 -0.197500 0.366747 -0.346323 -0.373748 -0.225482 -0.197047 -0.254821 0.287229 0.231510 0.216571 0.222260 0.237992 0.237645 0.289490 0.240159 0.247705 0.250241 0.224424 0.228476 0.229169
chargesum: 0.00000
title: Mulliken charges with hydrogens summed into heavy atoms:
elementType: O O O N C C C C C C C C C C C C C C C
charge: -0.271794 -0.203505 -0.204963 0.022341 0.540418 -0.234079 -0.092384 0.365288 0.059422 -0.157405 0.063176 -0.078516 0.042660 0.366747 -0.098618 -0.123507 -0.001058 0.031429 -0.025652
polarizability: 3.28672424e+02 2.87777509e+00 1.68204052e+02 6.59462651e+00 1.01005207e+01 9.52567848e+01
1716.lowfreq: -12.2811 -4.4024 -1.4458 -0.0006 0.0004 0.0007 13.8594 27.3668 33.8788
frequency: 13.6315 27.3502 33.8671 52.8148 74.6971 87.7853 133.2129 151.6722 166.8385 182.8553 230.3617 255.1058 280.1342 353.9936 371.4849 412.0193 425.4970 429.1429 442.9927 502.5414 525.2415 528.1792 586.4589 609.7197 627.3106 667.2919 681.6343 692.2719 703.1452 757.9659 764.5864 784.0503 816.2733 821.7945 844.4925 889.4378 893.5278 934.6096 947.4769 958.7642 961.2068 983.2471 983.4757 986.9443 987.7441 994.6502 1001.5951 1022.2338 1083.3168 1089.2839 1090.9168 1122.4733 1167.3654 1177.8017 1180.0936 1193.6219 1209.4680 1212.5566 1232.9888 1287.3375 1296.5405 1314.1184 1320.1120 1357.4625 1373.7682 1388.1855 1400.3749 1438.1852 1442.7892 1465.6827 1479.6511 1482.2162 1580.6896 1591.7267 1610.8659 1616.5052 1676.9510 2932.7532 3004.7017 3092.4231 3125.0748 3128.8949 3137.8778 3144.9346 3155.3265 3163.3203 3163.8368 3166.4956 3173.3746 3189.8800
redmass: 4.9558 5.4794 5.9563 8.3188 4.8221 4.2934 4.9732 3.3831 4.8111 3.2937 4.8405 5.1613 3.6144 4.0352 7.2651 2.9350 3.3619 6.0087 4.3270 2.8841 6.1339 4.5312 6.9800 6.3941 5.0548 7.2121 2.3168 2.0463 4.3642 1.6632 7.1926 4.9295 1.5385 1.2891 1.7704 1.4959 3.8706 1.5350 1.4346 6.3530 1.3717 1.4276 3.7859 1.8579 1.9983 2.0312 1.3458 2.0695 1.5187 1.6665 1.9847 2.4956 1.1029 1.2335 1.1634 1.0902 3.0493 3.7147 2.9406 1.2639 1.6587 1.3362 1.2713 1.5639 10.3844 6.6265 3.9775 3.1347 2.3434 1.2147 1.9510 2.5972 6.2340 6.3905 6.3102 6.8132 6.1318 1.0587 1.1018 1.0911 1.0897 1.0849 1.0888 1.0873 1.0923 1.0957 1.0937 1.0930 1.1008 1.0963
irintensity: 1.7106 0.7354 0.5408 0.5353 1.4912 3.1191 0.5285 1.8421 1.9496 1.2704 0.5488 1.6254 2.6091 0.8032 3.3963 0.0821 0.3222 3.0279 1.0674 12.4969 0.6292 3.2628 11.4819 0.5295 0.2831 17.4167 10.0870 39.9088 27.9642 94.9468 22.2771 11.5448 28.1175 6.4325 2.4239 5.6325 15.0400 1.2701 11.1553 124.9139 0.5078 1.2921 8.1338 34.9870 20.9176 1.5697 10.1871 22.4066 14.1069 13.0322 20.2799 5.6216 26.8290 118.8029 20.9377 14.4885 426.9528 54.6467 81.0153 6.0184 4.7330 1.7295 2.8080 45.3609 103.9343 16.8951 31.9037 25.9379 3.7302 54.5377 108.2012 6.4934 1.7771 39.8104 97.3424 3.6479 0.5438 31.7605 27.1689 12.9427 18.7880 4.6432 10.3536 4.8625 38.4476 20.1302 8.6013 7.9581 7.4169 5.1850
temp: 298.150 k
press: 1.00000 atm
elementType: 8 8 8 7 6 6 6 6 6 6 6 6 6 6 6 6 6 6 6 1 1 1 1 1 1 1 1 1 1 1 1 1
symmnumber: 1
zpe: 640272.9 jmol-1
zpe.correction: 0.243867 hartree
zpe.thermalcorrener: 0.260469 hartree
zpe.thermalcorrenthalpy: 0.261413 hartree
zpe.thermalcorrgfe: 0.196040 hartree
zpe.sumelectzpe: -858.366313 hartree
zpe.sumelectthermal: -858.349711 hartree
zpe.sumelectthermalent: -858.348767 hartree
zpe.sumelectthermalfe: -858.414140 hartree
dipole: -3.8229 2.3011 -1.9824
dipole: 4.8826
quadrupole: -137.0265 -104.8410 -111.7037
quadrupole: 20.2140 -3.3320 3.9006
quadrupole: -19.1695 13.0161 6.1534 20.2140 -3.3320 3.9006
hfenergy: -858.61018 hartree
pointgroup: C01 [X(C15H13N1O3)]
dipole: 1.4725915 0.8054766 0.9342194 debye
polarizability: 327.963661|-3.5965558|169.55929|14.2990115|-1.2614677|94.6103098 unknown
InChI: InChI=1S/C15H13NO3/c17-16(18)14-8-4-6-13(12-14)7-5-11-19-15-9-2-1-3-10-15/h1-10,12H,11H2
charge 0 multiplicity 1
32 atoms
O  2.796031 0.474889 -0.072028
O  -6.683442 -0.473929 -0.778905
O  -5.207573 -2.198334 -0.993446
N  -5.493354 -0.969897 -0.716866
C  -2.003799 0.241999 0.163455
C  -3.078783 -0.595568 -0.232848
C  -0.644995 -0.334247 0.222608
C  -4.384431 -0.071114 -0.30069
C  1.838062 -0.368657 0.672533
C  -2.293487 1.601919 0.481746
C  0.498832 0.30663 0.589896
C  -4.677734 1.272733 0.011428
C  -3.607596 2.105507 0.405033
C  4.152785 0.097383 -0.037909
C  4.649107 -1.054856 0.621222
C  5.035397 0.963722 -0.730218
C  6.037331 -1.327677 0.582472
C  6.413858 0.67664 -0.759558
C  6.925157 -0.47029 -0.102251
H  -2.914387 -1.646705 -0.489532
H  -0.574495 -1.394222 -0.063442
H  2.17504 -0.442331 1.730238
H  1.805165 -1.38988 0.241352
H  -1.484346 2.272114 0.789709
H  0.500755 1.368401 0.86828
H  -5.706535 1.634652 -0.056549
H  -3.803042 3.153685 0.652958
H  3.981723 -1.739372 1.153271
H  4.621936 1.844037 -1.232009
H  6.420096 -2.219234 1.092047
H  7.09165 1.349503 -1.296574
H  7.997478 -0.690003 -0.12692
