program: Gaussian 09
title: 000258014
version: EM64L-G09RevD.01
frameworkgroup: C1[X(C16H15ClO)]
method: RPBEPBE
basis: SDD
operation: Freq
keyword: #p
keyword: freq=noraman
keyword: PBEPBE/SDD
title: #p freq=noraman PBEPBE/SDD
converged: YES YES NO NO
title: Mulliken charges:
elementType: Cl O C C C C C C C C C C C C C C C C H H H H H H H H H H H H H H H
charge: -0.055565 -0.266818 0.348132 0.440535 -0.379776 0.521404 -0.336405 -0.372222 -0.425207 -0.332093 -0.180524 -0.330065 -0.808781 -0.377787 -0.390249 -0.219140 -0.224694 -0.108416 0.212485 0.216258 0.245703 0.248044 0.226378 0.229563 0.236638 0.224020 0.228398 0.228579 0.222451 0.232874 0.234926 0.255147 0.256205
chargesum: 0.00000
title: Mulliken charges with hydrogens summed into heavy atoms:
elementType: Cl O C C C C C C C C C C C C C C C C
charge: -0.055565 -0.266818 0.348132 0.440535 0.048967 0.521404 -0.090702 -0.124178 -0.198829 -0.102530 0.056115 -0.106044 -0.129353 -0.144913 -0.155323 0.036007 0.031511 -0.108416
polarizability: 3.58356901e+02 -4.30722932e+00 1.53669184e+02 -9.61882935e+00 -5.17146445e+00 1.01599194e+02
1716.lowfreq: -14.7445 -2.2654 -0.0021 -0.0021 -0.0011 1.6484 17.5310 24.2836 28.2150
frequency: 17.4675 23.9978 28.2043 36.0276 56.5029 81.9246 114.2901 130.7529 154.8331 185.7698 206.4465 263.4411 302.7779 327.9431 334.8265 359.4862 387.9821 409.8618 414.1774 447.8514 468.2223 506.0647 508.4755 558.1149 626.2858 633.4961 665.0037 707.7982 711.0247 733.4599 802.4500 807.2891 816.2660 825.4568 829.0779 831.8549 868.2065 928.8970 950.8310 954.8100 962.8235 965.1615 984.2058 985.5662 988.1404 998.2053 1005.5549 1047.2348 1074.3374 1103.9161 1121.3519 1126.9009 1178.0871 1187.7533 1195.3937 1211.6984 1222.8824 1225.6962 1288.2759 1293.0567 1305.6866 1315.5337 1354.6505 1373.0573 1384.3669 1399.0276 1404.2531 1414.5534 1469.3411 1470.3671 1476.7535 1480.4903 1501.9527 1577.4424 1585.9471 1599.9355 1625.9153 1673.6004 2930.8178 2973.4262 2999.6237 3050.0520 3080.8853 3082.7621 3121.7062 3123.3117 3124.0484 3131.4105 3144.9168 3159.6025 3163.8510 3170.2240 3173.3282
redmass: 4.9303 2.4614 6.1976 1.2715 5.0770 4.8492 5.7688 2.5214 4.4974 4.0642 4.9046 4.3841 3.4746 4.2695 4.0876 5.5134 3.6769 2.8723 2.9592 3.7204 6.4522 2.8228 2.5158 4.6118 7.0929 6.8068 5.3886 3.3651 3.0258 4.3303 1.6943 2.4895 1.9765 1.2891 1.3561 3.0965 2.0310 1.3300 1.3449 6.0924 1.3486 1.3796 1.3347 1.2949 1.8185 3.8737 2.6226 1.5257 2.7612 1.7178 1.2598 1.9286 1.3990 1.1209 1.0944 2.0650 3.7344 2.2406 1.2977 1.4473 1.2951 1.3995 1.7814 4.2769 2.9821 1.2518 2.8889 3.5099 1.1229 1.0456 1.0985 2.4371 2.5412 7.1609 6.4244 6.1247 6.4189 6.1259 1.0580 1.0372 1.1026 1.0978 1.0984 1.0904 1.0893 1.0900 1.0890 1.0898 1.0883 1.0938 1.0953 1.0955 1.0965
irintensity: 0.0463 0.0631 0.1121 0.8165 0.6414 2.1434 0.1306 1.2983 0.3558 3.9076 0.3901 1.8928 1.1623 4.8463 10.5823 3.9262 2.9965 0.0644 0.1551 2.1013 10.9950 24.2519 13.5692 4.4694 0.2730 0.1392 14.9455 0.8157 0.5157 10.0809 54.6342 9.9392 14.9218 3.0898 30.8600 41.6571 25.0261 1.1227 12.1902 162.4591 0.6588 0.5348 20.4289 33.0552 4.6019 32.9419 7.4326 11.1299 58.9957 7.0164 15.7026 4.3749 160.2832 2.5330 22.2228 260.3638 31.3905 7.3139 1.1451 4.5450 2.4943 1.9070 20.7234 7.1136 35.1309 11.2296 14.3929 2.7690 31.9362 12.2515 12.6429 99.2114 160.9125 0.6173 23.1130 14.4752 45.9957 4.6541 34.4833 54.5018 30.0283 24.2082 20.1503 18.9443 18.0716 24.0599 25.3196 14.0483 6.1860 21.8559 3.1851 8.4969 1.0369
temp: 298.150 k
press: 1.00000 atm
elementType: 17 8 6 6 6 6 6 6 6 6 6 6 6 6 6 6 6 6 1 1 1 1 1 1 1 1 1 1 1 1 1 1 1
symmnumber: 1
zpe: 682031.3 jmol-1
zpe.correction: 0.259772 hartree
zpe.thermalcorrener: 0.276952 hartree
zpe.thermalcorrenthalpy: 0.277896 hartree
zpe.thermalcorrgfe: 0.210827 hartree
zpe.sumelectzpe: -1152.682960 hartree
zpe.sumelectthermal: -1152.665780 hartree
zpe.sumelectthermalent: -1152.664836 hartree
zpe.sumelectthermalfe: -1152.731905 hartree
dipole: -1.8760 1.6100 0.6851
dipole: 2.5654
quadrupole: -118.5000 -103.6167 -114.9921
quadrupole: 0.9904 -0.8182 -2.4940
quadrupole: -6.1304 8.7529 -2.6225 0.9904 -0.8182 -2.4940
hfenergy: -1152.9427319 hartree
pointgroup: C01 [X(C16H15Cl1O1)]
dipole: -0.7386932 -0.6361021 -0.2614763 debye
polarizability: 358.4811442|4.8394399|153.6682991|7.3661943|-5.3167093|101.4758352 unknown
InChI: InChI=1S/C16H15ClO/c1-13-4-10-16(11-5-13)18-12-2-3-14-6-8-15(17)9-7-14/h2-11H,12H2,1H3
charge 0 multiplicity 1
33 atoms
Cl 7.632866 0.604327 0.174445
O  -1.624521 0.519719 0.136814
C  -3.018417 0.31494 0.1568
C  -5.862996 0.115765 0.304951
C  -0.794026 -0.557385 -0.445907
C  3.090916 -0.407092 0.08145
C  -3.669913 -0.856797 -0.296754
C  -3.781264 1.386589 0.684957
C  -5.081246 -0.940605 -0.217135
C  -5.181767 1.281051 0.75522
C  0.627391 -0.074051 -0.457169
C  1.662023 -0.776221 0.084256
C  -7.377171 0.019224 0.387709
C  3.592078 0.775613 -0.535414
C  4.022719 -1.269177 0.725212
C  4.965093 1.08776 -0.508328
C  5.401759 -0.973479 0.761927
C  5.853915 0.205949 0.141503
H  -1.15199 -0.758621 -1.479847
H  -0.898752 -1.487052 0.150286
H  -3.106483 -1.702262 -0.702779
H  -3.257089 2.282438 1.032241
H  -5.577736 -1.852623 -0.570483
H  -5.760046 2.117437 1.167182
H  0.786473 0.89411 -0.949326
H  1.427459 -1.72769 0.585708
H  -7.733022 0.127457 1.429863
H  -7.866443 0.814518 -0.206245
H  -7.741108 -0.951706 0.009293
H  2.908233 1.463311 -1.04363
H  3.66266 -2.185613 1.20794
H  5.341421 1.998303 -0.983497
H  6.106984 -1.64374 1.261255
