program: Gaussian 09
title: 000258115
version: EM64L-G09RevD.01
frameworkgroup: C1[X(C26H16N4O4)]
method: RPBEPBE
basis: SDD
operation: Freq
keyword: #p
keyword: freq=noraman
keyword: PBEPBE/SDD
title: #p freq=noraman PBEPBE/SDD
converged: YES YES NO NO
title: Mulliken charges:
elementType: O O O O N N N N C C C C C C C C C C C C C C C C C C C C C C C C C C H H H H H H H H H H H H H H H H
charge: -0.202456 -0.202503 -0.201478 -0.201472 -0.024562 -0.025262 0.027582 0.027643 0.196567 0.196186 -0.129992 -0.130692 0.099399 0.098686 0.401883 0.402235 -0.375647 -0.375330 -0.360291 -0.360772 -0.323698 -0.322697 -0.375427 -0.374878 -0.252923 -0.252953 -0.221432 -0.221383 -0.384381 -0.384952 -0.361781 -0.361870 0.380033 0.379883 0.253890 0.253906 0.253626 0.253470 0.256652 0.256118 0.294333 0.294275 0.234778 0.234791 0.236092 0.235984 0.290045 0.290062 0.290389 0.290325
chargesum: 0.00000
title: Mulliken charges with hydrogens summed into heavy atoms:
elementType: O O O O N N N N C C C C C C C C C C C C C C C C C C C C C C C C C C
charge: -0.202456 -0.202503 -0.201478 -0.201472 -0.024562 -0.025262 0.027582 0.027643 0.196567 0.196186 -0.129992 -0.130692 0.099399 0.098686 0.401883 0.402235 -0.121757 -0.121423 -0.106666 -0.107302 -0.067047 -0.066579 -0.081094 -0.080603 -0.018146 -0.018162 0.014660 0.014601 -0.094336 -0.094891 -0.071392 -0.071545 0.380033 0.379883
polarizability: 4.57586425e+02 1.26708283e+01 3.98036025e+02 -6.05688675e+00 3.08943318e+01 3.04025070e+02
1716.lowfreq: -1.3118 -0.0006 0.0002 0.0007 2.3980 6.4033 16.2262 28.4459 29.4835
frequency: 16.1973 28.4135 29.4230 33.2403 38.9522 64.8537 67.8317 70.7186 78.5812 88.7726 92.7936 111.5327 115.5281 161.4834 165.6196 182.9719 197.3854 241.3589 248.3971 259.6723 277.2667 306.2846 307.3041 331.8518 365.6525 367.6705 395.6704 407.2995 408.3471 434.9912 442.2211 461.8668 486.7920 505.2126 507.5342 508.5905 532.6205 549.9601 555.3391 574.8216 577.6208 598.7161 607.9407 622.1986 626.2260 630.6619 663.9605 667.1884 684.0503 691.4254 699.5351 716.2930 726.4258 749.6656 755.4462 763.4725 764.2068 774.8609 786.2601 789.8299 816.6858 838.9737 853.0203 856.6935 868.4891 877.7586 879.7823 885.2174 920.3334 949.9100 954.1427 986.5711 986.7871 990.4979 993.0366 993.5311 1001.4118 1003.5394 1015.8765 1016.4028 1026.6575 1039.9289 1047.6391 1091.5196 1091.9938 1094.9106 1108.7462 1110.2241 1116.5343 1171.3991 1172.6512 1176.2855 1178.6244 1179.4269 1202.6537 1214.1507 1218.0603 1235.7375 1249.3474 1281.9072 1283.9692 1292.2647 1296.1857 1297.1140 1355.4612 1356.7501 1363.5814 1364.4156 1401.5137 1402.8801 1414.2087 1415.4360 1422.1218 1429.2961 1455.4192 1477.1415 1478.5611 1483.3079 1560.2092 1565.4435 1570.0500 1571.7234 1591.0340 1591.3976 1603.2874 1604.7741 1611.0768 1612.3403 3132.4694 3133.6932 3141.5039 3142.6298 3152.0504 3152.6405 3155.7216 3156.1655 3166.1705 3166.2037 3170.8808 3171.2918 3184.6490 3184.8046 3187.3815 3187.5201
redmass: 9.6330 6.9899 6.7412 6.9663 7.2323 6.5616 5.9351 5.6635 4.5216 7.4697 6.8983 4.2760 5.8984 7.5074 8.6861 8.5044 7.7824 7.7941 7.0868 6.4128 7.5235 4.7108 6.7310 5.6196 4.4582 6.2427 7.3769 2.9352 2.9097 5.2901 6.4345 3.8994 4.8350 6.0827 6.3696 5.4466 3.8280 5.0070 4.3436 5.1837 6.4710 6.4788 6.9151 6.8564 7.1077 7.1149 5.0984 4.6426 6.8277 6.9919 4.5759 6.4556 3.6586 4.6694 4.3706 2.7840 1.4646 1.6158 7.8699 8.9463 6.0683 5.5838 1.3220 1.2973 1.3984 1.4468 1.6269 1.6539 5.2907 1.4207 1.3835 1.3411 1.3277 6.3242 1.3775 1.3608 3.5951 2.9345 1.3624 1.3630 4.0576 2.3499 2.0614 3.2000 3.0403 2.2064 1.3732 1.3102 1.6175 1.3166 1.0777 1.3960 1.3740 1.7382 3.2069 5.7610 5.5590 1.9878 2.5352 1.8600 1.8783 3.0675 1.3220 1.3905 7.5821 9.3357 7.5291 7.9105 10.1826 10.5884 4.1754 4.1374 2.2796 2.2482 2.4225 2.6114 2.5098 2.9563 6.3348 7.8449 7.8608 9.5874 7.6692 7.8542 6.5815 6.5713 6.9789 7.3214 1.0859 1.0855 1.0893 1.0896 1.0901 1.0899 1.0945 1.0945 1.0892 1.0893 1.1010 1.1009 1.0950 1.0949 1.0966 1.0965
irintensity: 0.5890 0.2538 0.1280 0.0035 0.0579 1.0505 0.0201 0.0418 0.4031 3.1369 0.8436 5.6364 6.0520 4.7788 0.3384 2.1736 3.0838 0.6983 0.1234 2.1067 3.6708 4.9075 2.4717 0.4695 1.8884 1.3291 2.1128 0.0336 0.0505 3.1401 9.5035 0.5086 4.7767 0.5982 2.9385 1.9219 11.3598 0.4073 19.1523 6.7601 1.5655 7.5575 3.0492 0.6177 1.5403 1.1198 22.3100 17.3506 19.0431 15.4656 4.3156 3.4148 25.5269 9.4998 0.9042 7.2358 67.1249 26.5786 43.4270 23.4430 33.5504 21.2678 5.2219 1.0889 2.0808 0.1300 34.8560 29.7895 58.8783 8.5055 0.2302 0.2647 0.0944 1.7642 2.3249 1.7225 8.5481 4.3424 0.1944 0.2227 4.7064 10.5699 9.4653 24.0503 26.8128 7.9402 36.6235 3.9626 2.7259 5.6336 0.7010 0.3503 47.1274 88.9099 27.7999 498.4082 447.7278 2.9676 2.2464 3.6750 4.1788 23.5392 1.7105 7.0342 0.0888 2.2657 125.5398 31.8774 43.5340 0.1940 94.4166 1.6969 9.4758 3.5151 28.8996 0.3600 3.3661 2.4996 0.0069 9.7359 12.4572 4.7975 2.2405 2.1107 1.2441 10.3020 56.5756 40.9488 0.7551 0.5176 11.0054 0.0281 8.5524 0.3195 10.9980 16.0038 1.8801 0.5320 41.1640 21.9946 0.7680 0.7838 1.5207 1.4597
temp: 298.150 k
press: 1.00000 atm
elementType: 8 8 8 8 7 7 7 7 6 6 6 6 6 6 6 6 6 6 6 6 6 6 6 6 6 6 6 6 6 6 6 6 6 6 1 1 1 1 1 1 1 1 1 1 1 1 1 1 1 1
symmnumber: 1
zpe: 945473.4 jmol-1
zpe.correction: 0.360112 hartree
zpe.thermalcorrener: 0.386924 hartree
zpe.thermalcorrenthalpy: 0.387868 hartree
zpe.thermalcorrgfe: 0.300192 hartree
zpe.sumelectzpe: -1517.795014 hartree
zpe.sumelectthermal: -1517.768202 hartree
zpe.sumelectthermalent: -1517.767258 hartree
zpe.sumelectthermalfe: -1517.854934 hartree
dipole: -7.2221 -1.5575 0.0028
dipole: 7.3881
quadrupole: -212.8122 -240.0220 -180.0549
quadrupole: 6.1500 -1.8315 8.6765
quadrupole: -1.8492 -29.0590 30.9082 6.1500 -1.8315 8.6765
hfenergy: -1518.1551258 hartree
pointgroup: C01 [X(C26H16N4O4)]
dipole: 0.7264449 -2.8127833 -0.0975348 debye
polarizability: 402.2837659|-13.3524436|456.8831798|-25.813721|-0.4074612|300.4805749 unknown
InChI: InChI=1S/C26H16N4O4/c31-29(32)19-13-9-17(10-14-19)25-26(18-11-15-20(16-12-18)30(33)34)28-24-8-4-2-6-22(24)21-5-1-3-7-23(21)27-25/h1-16H
charge 0 multiplicity 1
50 atoms
O  3.584327 5.50879 -0.226157
O  -5.775972 3.055638 0.525398
O  4.382075 4.909946 1.826291
O  -6.236509 2.249468 -1.55921
N  0.700244 -1.052068 1.549808
N  -0.11027 -1.161092 -1.622825
N  3.659683 4.699252 0.777069
N  -5.472954 2.368045 -0.524785
C  0.317769 -3.269727 0.471708
C  1.265252 -3.00512 -0.662477
C  0.568063 -0.185112 0.574812
C  -0.390015 -0.391132 -0.59888
C  0.07137 -2.327789 1.523004
C  1.040761 -1.996288 -1.655248
C  1.354486 1.079802 0.619672
C  -1.687299 0.342018 -0.578406
C  -0.266271 -4.558652 0.585439
C  2.375689 -3.872213 -0.83619
C  -0.709449 -2.699534 2.649237
C  1.896807 -1.90013 -2.784146
C  1.311444 2.007869 -0.457411
C  -2.072947 1.117269 0.550135
C  2.17779 1.360571 1.747481
C  -2.572213 0.243446 -1.690136
C  -1.086017 -4.90901 1.679367
C  3.255631 -3.742095 -1.931557
C  -1.306732 -3.972778 2.717148
C  3.012646 -2.749688 -2.910548
C  2.066487 3.194176 -0.413867
C  -3.312145 1.782767 0.574915
C  2.932189 2.542498 1.807649
C  -3.80913 0.906543 -1.6823
C  2.864168 3.446536 0.721893
C  -4.162737 1.669303 -0.544773
H  -0.079647 -5.28657 -0.212034
H  2.552636 -4.648797 -0.08366
H  -0.835538 -1.973203 3.458415
H  1.668109 -1.151715 -3.549544
H  0.693478 1.80131 -1.336945
H  -1.409126 1.194549 1.417009
H  2.207702 0.629778 2.560366
H  -2.26449 -0.367521 -2.543266
H  -1.53636 -5.905792 1.728593
H  4.114058 -4.414942 -2.027311
H  -1.926357 -4.238905 3.580093
H  3.67865 -2.649372 -3.774163
H  2.04987 3.92012 -1.230616
H  -3.630201 2.380448 1.432801
H  3.567798 2.779559 2.664639
H  -4.502902 0.84584 -2.524685
