program: Gaussian 09
title: 000258005
version: EM64L-G09RevD.01
frameworkgroup: C1[X(C12H17NO4)]
method: RPBEPBE
basis: SDD
operation: Freq
keyword: #p
keyword: freq=noraman
keyword: PBEPBE/SDD
title: #p freq=noraman PBEPBE/SDD
converged: YES YES NO NO
title: Mulliken charges:
elementType: O O O O N C C C C C C C C C C C C H H H H H H H H H H H H H H H H H
charge: -0.290113 -0.290101 -0.290721 -0.290749 -0.206742 -0.596678 0.244851 0.244849 0.135312 0.135298 -0.641685 -0.806902 -0.806877 0.111423 0.111452 -0.498337 -0.498340 0.230508 0.302563 0.248004 0.248004 0.235723 0.324989 0.224716 0.231760 0.231756 0.224688 0.325021 0.237508 0.227851 0.237803 0.237796 0.227853 0.237515
chargesum: 0.00000
title: Mulliken charges with hydrogens summed into heavy atoms:
elementType: O O O O N C C C C C C C C C C C C
charge: -0.290113 -0.290101 -0.290721 -0.290749 -0.206742 -0.063606 0.244851 0.244849 0.135312 0.135298 0.090046 -0.025437 -0.025412 0.111423 0.111452 0.204825 0.204824
polarizability: 1.99229088e+02 2.63329969e-03 2.08360801e+02 9.47212581e-04 -3.92915392e+00 9.16021381e+01
1716.lowfreq: -0.9786 -0.0006 0.0000 0.0006 4.2842 9.8806 35.1391 39.7046 50.2831
frequency: 35.1384 39.6405 50.2826 68.9450 99.4760 104.3543 106.3116 123.7164 146.8924 155.3039 163.3441 179.8436 187.6949 217.9673 234.1785 287.0534 289.3418 297.2290 317.9036 336.7220 348.6614 367.0131 393.5414 415.8443 421.5074 503.0964 547.3282 590.6663 609.5783 642.5634 661.3655 697.3452 720.9545 726.6846 769.6668 815.4632 884.1290 941.9111 955.5048 989.2042 1025.5625 1034.6006 1045.9636 1046.3685 1102.8133 1107.0459 1111.4048 1111.5108 1121.5727 1140.7799 1142.5297 1148.6636 1160.5300 1199.2381 1241.7213 1284.7782 1296.5619 1319.2765 1362.6133 1401.4602 1402.9067 1420.7136 1421.7569 1445.3919 1445.8418 1448.9230 1449.2972 1452.0964 1464.1539 1464.5040 1479.3008 1479.8718 1485.5471 1501.3674 1502.6805 1575.6236 1592.4075 1595.6859 1646.8791 2930.4669 2974.1487 2974.4715 2981.6465 2998.9811 2999.2414 3055.6333 3055.8921 3088.2786 3097.9832 3098.1456 3113.6527 3113.9197 3129.3261 3131.7426 3140.1698 3140.3465
redmass: 4.1645 5.0194 5.3774 3.3828 1.7280 1.1400 1.5374 3.1520 3.0165 1.0882 3.0024 2.9372 1.2023 1.1859 2.1856 5.0714 3.2357 3.8950 5.0033 4.1926 6.4792 3.4098 5.2949 5.0025 2.6138 5.1491 4.2459 3.2540 3.8369 5.5276 5.2543 5.1894 8.8849 6.6689 4.7679 4.7531 4.8204 3.1801 1.9931 3.1983 2.0230 2.7849 1.5362 1.5729 2.9495 1.5963 1.2652 1.2679 2.7376 1.4588 1.6526 2.1391 4.9103 1.5330 1.5417 6.0707 6.6687 3.2155 2.6618 1.2172 1.2407 1.1924 1.1979 1.1127 1.0907 1.0510 1.0515 1.1666 1.0532 1.0524 1.0555 1.0844 1.0758 1.0583 1.0539 5.4671 7.6229 7.7394 7.0136 1.0733 1.0409 1.0413 1.0453 1.0295 1.0295 1.0940 1.0939 1.0882 1.1040 1.1040 1.0983 1.0983 1.1009 1.0864 1.1044 1.1044
irintensity: 0.1485 0.4141 6.3493 0.1268 1.4775 0.0449 0.6759 2.8758 1.0654 0.3268 7.8060 1.3994 3.6269 0.2242 4.3983 0.5392 8.2076 1.4834 25.6157 2.4205 2.1256 5.4203 3.4264 10.6674 0.0213 11.5576 4.0446 1.6604 0.2699 5.0099 2.6482 8.8793 2.8953 13.3330 0.0003 14.6335 22.8201 4.5414 0.4805 183.1992 5.5558 188.4687 8.6616 14.0097 127.3033 128.8496 0.1891 0.6276 161.5848 65.2016 184.7036 7.9027 81.5975 105.0839 88.8873 161.6705 34.4265 231.5726 78.0168 75.5767 16.2188 33.2119 21.4179 131.9033 33.6674 1.4368 20.8937 26.0977 0.2242 26.4146 2.7276 0.9274 2.2570 6.3723 41.8680 609.9477 26.3450 4.9989 303.8696 38.2062 1.1611 33.9892 103.4195 46.3358 52.6776 2.3546 37.9152 24.5294 5.3942 55.0229 0.3511 7.0488 10.5273 0.3114 4.7524 31.5888
temp: 298.150 k
press: 1.00000 atm
elementType: 8 8 8 8 7 6 6 6 6 6 6 6 6 6 6 6 6 1 1 1 1 1 1 1 1 1 1 1 1 1 1 1 1 1
symmnumber: 1
zpe: 718640.8 jmol-1
zpe.correction: 0.273716 hartree
zpe.thermalcorrener: 0.292747 hartree
zpe.thermalcorrenthalpy: 0.293692 hartree
zpe.thermalcorrgfe: 0.225896 hartree
zpe.sumelectzpe: -821.808361 hartree
zpe.sumelectthermal: -821.789329 hartree
zpe.sumelectthermalent: -821.788385 hartree
zpe.sumelectthermalfe: -821.856181 hartree
dipole: 0.0004 2.0477 0.9813
dipole: 2.2708
quadrupole: -112.8786 -73.3754 -101.2897
quadrupole: -0.0022 -0.0016 1.7973
quadrupole: -17.0307 22.4725 -5.4418 -0.0022 -0.0016 1.7973
hfenergy: -822.0820767 hartree
pointgroup: C01 [X(C12H17N1O4)]
dipole: 0.0006159 -0.838183 -0.3091634 debye
polarizability: 199.2290825|-0.0024289|206.6117068|0.0322971|-14.7173503|93.3512382 unknown
InChI: InChI=1S/C12H17NO4/c1-7-9(11(14)16-4)6-10(12(15)17-5)8(2)13(7)3/h6H2,1-5H3
charge 0 multiplicity 1
34 atoms
O  -2.213433 2.009592 -0.576767
O  2.213465 2.011653 -0.57562
O  -3.597889 0.334877 0.242024
O  3.598878 0.337947 0.243686
N  0.001838 -2.208421 -0.22633
C  0.000693 0.487185 -0.976405
C  -1.235385 -1.514295 -0.116855
C  1.238342 -1.513086 -0.116324
C  -1.253512 -0.154931 -0.39004
C  1.25526 -0.153732 -0.389509
C  0.002518 -3.687629 -0.218019
C  -2.426902 -2.333895 0.331339
C  2.430535 -2.331352 0.332503
C  -2.45657 0.672386 -0.191474
C  2.457511 0.6746 -0.190349
C  -3.359149 2.926671 -0.406526
C  3.358332 2.929662 -0.404691
H  0.000975 0.373101 -2.082484
H  0.000137 1.566702 -0.786043
H  0.891591 -4.059483 -0.74819
H  -0.886102 -4.060273 -0.748397
H  0.002576 -4.112293 0.804538
H  -3.23231 -1.657454 0.64979
H  -2.162828 -3.014126 1.160537
H  -2.82549 -2.951631 -0.497388
H  2.830281 -2.948637 -0.496002
H  2.166806 -3.011859 1.161579
H  3.235011 -1.65398 0.651353
H  -4.216621 2.59094 -1.01446
H  -2.987791 3.903309 -0.749097
H  -3.668877 2.96764 0.651734
H  3.667284 2.970992 0.653783
H  2.986429 3.905969 -0.747616
H  4.216498 2.594552 -1.011985
