program: Gaussian 09
title: 000258015
version: EM64L-G09RevD.01
frameworkgroup: C1[X(C16H15NO3)]
method: RPBEPBE
basis: SDD
operation: Freq
keyword: #p
keyword: freq=noraman
keyword: PBEPBE/SDD
title: #p freq=noraman PBEPBE/SDD
converged: YES YES NO NO
title: Mulliken charges:
elementType: O O O N C C C C C C C C C C C C C C C C H H H H H H H H H H H H H H H
charge: -0.269785 -0.211578 -0.212030 0.026615 0.538949 0.351002 0.440159 -0.375360 -0.335195 -0.335250 -0.372807 -0.423888 -0.331076 -0.168186 -0.366224 -0.381739 0.374367 -0.369756 -0.372025 -0.807481 0.217390 0.220176 0.232344 0.244903 0.248927 0.228055 0.231360 0.242020 0.238257 0.241970 0.286354 0.287166 0.230482 0.228742 0.223142
chargesum: 0.00000
title: Mulliken charges with hydrogens summed into heavy atoms:
elementType: O O O N C C C C C C C C C C C C C C C C
charge: -0.269785 -0.211578 -0.212030 0.026615 0.538949 0.351002 0.440159 0.062207 -0.102851 -0.090347 -0.123880 -0.195833 -0.099716 0.073834 -0.127967 -0.139769 0.374367 -0.083402 -0.084860 -0.125115
polarizability: 3.98488648e+02 -4.48841346e+00 1.71063276e+02 1.16453288e+01 4.56450172e+00 1.01889613e+02
1716.lowfreq: -2.1719 -1.5943 -0.0008 -0.0006 0.0005 7.5227 16.2177 25.0453 27.1587
frequency: 16.1525 24.9644 27.0324 53.7396 58.1472 68.5426 81.3867 112.4390 131.4520 153.6746 176.4036 198.4322 240.4141 292.5974 325.9549 331.1905 346.4411 377.4263 410.5842 413.4928 445.9690 465.4546 501.8572 508.1763 510.3459 558.5274 627.1193 633.2174 651.3902 665.5531 710.5038 722.6699 743.0713 770.5097 804.9580 811.9930 826.5261 830.0927 843.0481 847.1285 883.1984 929.4156 964.1014 964.8045 979.0820 986.5569 990.0759 995.6072 997.8109 1002.5764 1005.9707 1047.9143 1094.7337 1105.6615 1122.1113 1126.3362 1178.9849 1183.5753 1192.7115 1211.3644 1221.5441 1223.5812 1229.5203 1289.7286 1295.7430 1306.5310 1319.9552 1353.4247 1364.7487 1376.3759 1399.9785 1406.0653 1414.0909 1424.7439 1466.1277 1470.9807 1477.6630 1484.4343 1502.0796 1587.0315 1587.6579 1608.9089 1625.7697 1669.5414 2927.0795 2974.4679 2998.7170 3051.6592 3081.6089 3089.1434 3123.4614 3125.6011 3127.8684 3139.2707 3154.7182 3157.7070 3164.1520 3183.3096 3185.6527
redmass: 5.2610 4.4376 6.1502 2.8754 1.2768 7.1850 4.8829 5.5217 2.5451 4.5268 4.2820 4.4604 4.5445 3.6512 4.0421 3.8484 5.5196 4.0038 2.8620 2.9410 3.8566 6.5879 3.1833 2.5615 6.1793 4.7105 7.0836 6.8056 6.1267 4.4550 3.0102 4.1101 4.2840 7.1933 1.5156 3.9830 2.0743 1.3914 2.1417 1.5369 1.9185 1.3289 1.3501 5.2778 1.2438 1.5149 1.7926 1.4134 1.2555 2.9424 2.6088 1.5272 3.2117 1.7037 1.2621 1.8395 1.4295 1.4348 1.1216 2.1005 3.1492 3.7997 2.5415 1.2932 1.4942 1.2923 1.3538 2.1371 4.0139 3.4019 1.2494 5.1122 3.4639 3.5410 1.1142 1.0458 1.0984 2.4741 2.5414 6.8528 6.9727 6.1528 6.4185 6.0083 1.0589 1.0373 1.1011 1.0977 1.0986 1.0909 1.0892 1.0889 1.0898 1.0905 1.0891 1.0942 1.0955 1.0946 1.0958
irintensity: 0.3773 0.2628 0.6499 2.5351 0.2295 0.0905 3.0896 0.0636 0.6027 0.5320 6.2121 1.6889 2.8009 2.1291 4.2749 3.7175 0.4566 0.4370 0.0204 0.0312 0.5003 2.5843 10.4325 15.6877 3.4756 4.3462 0.2616 0.1322 4.1754 20.7401 0.5417 11.8912 5.3142 35.4167 48.2169 11.9313 7.7711 31.0574 5.5165 12.3707 32.4067 1.0306 0.6591 159.9419 36.5950 1.7152 13.8595 1.0195 18.2442 0.5735 9.0824 11.3322 23.5654 14.9640 16.0719 5.9110 271.3898 101.0081 64.5878 404.3363 218.7650 10.5955 42.3037 4.1392 1.7058 2.3658 6.7770 34.6683 90.9773 49.4482 11.2643 16.7211 2.5122 31.5285 32.1288 12.5074 12.7668 7.9965 176.6698 14.7535 15.6118 126.4531 36.3495 13.2645 34.2630 52.1734 28.3585 23.2843 19.7274 18.0685 16.4603 34.0416 10.8773 12.0002 6.0426 21.1288 3.7734 0.0914 3.1035
temp: 298.150 k
press: 1.00000 atm
elementType: 8 8 8 7 6 6 6 6 6 6 6 6 6 6 6 6 6 6 6 6 1 1 1 1 1 1 1 1 1 1 1 1 1 1 1
symmnumber: 1
zpe: 711011.3 jmol-1
zpe.correction: 0.270810 hartree
zpe.thermalcorrener: 0.289282 hartree
zpe.thermalcorrenthalpy: 0.290226 hartree
zpe.thermalcorrgfe: 0.220429 hartree
zpe.sumelectzpe: -897.596095 hartree
zpe.sumelectthermal: -897.577623 hartree
zpe.sumelectthermalent: -897.576679 hartree
zpe.sumelectthermalfe: -897.646476 hartree
dipole: 6.3041 -2.3073 0.9536
dipole: 6.7804
quadrupole: -159.4889 -108.3507 -118.6478
quadrupole: 5.5509 -0.2829 -0.4346
quadrupole: -30.6597 20.4784 10.1813 5.5509 -0.2829 -0.4346
hfenergy: -897.8669054 hartree
pointgroup: C01[X(C16H15N1O3)]
dipole: -2.4763767 0.8890539 0.4397009 debye
polarizability: 397.6157611|-2.7216593|170.9075954|-20.2606031|-5.2382321|102.9181802 unknown
InChI: InChI=1S/C16H15NO3/c1-13-4-10-16(11-5-13)20-12-2-3-14-6-8-15(9-7-14)17(18)19/h2-11H,12H2,1H3
charge 0 multiplicity 1
35 atoms
O  -2.378379 -0.464304 0.002143
O  6.93145 -1.494534 0.142106
O  7.31308 0.550934 -0.796579
N  6.529488 -0.343892 -0.289501
C  2.329167 0.556377 -0.017684
C  -3.777545 -0.292026 0.064214
C  -6.627504 -0.155363 0.077789
C  -1.544328 0.599822 0.591708
C  0.901292 0.916393 0.04596
C  -4.426839 0.843131 0.603471
C  -4.542624 -1.358475 -0.46915
C  -5.841926 0.896216 0.603844
C  -5.94692 -1.283833 -0.458882
C  -0.117103 0.13868 0.511099
C  2.839609 -0.695777 0.439084
C  3.247626 1.500289 -0.563802
C  5.086388 -0.032675 -0.19741
C  4.207579 -0.995861 0.351964
C  4.621202 1.217982 -0.658718
C  -8.145398 -0.089099 0.075053
H  -1.846145 0.746109 1.653033
H  -1.692994 1.556368 0.050079
H  0.653454 1.920809 -0.328362
H  -3.86093 1.683661 1.016588
H  -4.019137 -2.226392 -0.882037
H  -6.337944 1.779738 1.023562
H  -6.528377 -2.116096 -0.87441
H  0.058342 -0.881555 0.876022
H  2.161107 -1.440782 0.86587
H  2.871765 2.466395 -0.919805
H  4.611644 -1.95099 0.697476
H  5.332415 1.934882 -1.076893
H  -8.547806 -0.092706 -0.955879
H  -8.589301 -0.956165 0.599449
H  -8.510711 0.826036 0.572296
