program: Gaussian 09
title: 000257996
version: EM64L-G09RevD.01
frameworkgroup: C1[X(C17H16O)]
method: RPBEPBE
basis: SDD
operation: Freq
keyword: #pfreq=noraman
keyword: PBEPBE/SDD
title: #p freq=noraman PBEPBE/SDD
converged: YES YES NO NO
title: Mulliken charges:
elementType: O C C C C C C C C C C C C C C C C C H H H H H H H H H H H H H H H H
charge: -0.263236 0.482183 0.495265 -0.586533 0.396725 -0.514382 -0.596856 -0.817678 -0.811506 -0.351166 0.356376 -0.395453 -0.396591 0.007550 -0.221161 -0.217349 -0.243815 -0.093455 0.234244 0.249107 0.257454 0.225051 0.228318 0.228232 0.226042 0.228924 0.228982 0.237835 0.237881 0.245885 0.252741 0.229290 0.230154 0.230940
chargesum: 0.00000
title: Mulliken charges with hydrogens summed into heavy atoms:
elementType: O C C C C C C C C C C C C C C C C C
charge: -0.263236 0.482183 0.495265 -0.352290 0.396725 -0.265275 -0.339402 -0.136077 -0.127557 0.124550 0.356376 -0.149569 -0.143850 0.007550 0.008129 0.012805 -0.012874 -0.093455
polarizability: 3.24317710e+02 7.92300285e+00 1.91206428e+02 -1.10886380e-01 1.43704471e-01 8.58661905e+01
1716.lowfreq: -2.6617 -0.0008 -0.0007 0.0007 0.3306 10.1245 13.8109 19.3730 25.8933
frequency: 11.6237 17.8467 25.8360 28.3056 56.9732 72.5833 100.1984 122.0725 147.7185 184.5133 217.9051 234.8423 254.1226 255.1839 284.8484 371.6733 385.3885 401.6944 445.3953 488.7905 505.4673 521.6789 526.1141 537.6471 539.4502 573.8530 618.4580 635.4367 695.6177 697.6815 732.5183 773.4862 840.9018 854.8382 863.4563 887.6890 889.3924 927.5116 947.6095 965.0613 980.2948 983.3889 984.4317 990.7130 998.4958 999.4939 1018.1816 1031.8641 1037.7748 1045.7306 1049.9393 1079.9510 1148.6609 1173.6524 1175.9315 1188.4281 1198.9163 1278.2370 1289.2705 1299.4746 1313.1774 1363.6827 1369.5330 1388.6234 1395.6435 1398.3188 1430.9700 1433.5836 1452.1142 1463.2188 1469.5489 1471.1476 1483.3964 1485.5166 1486.7713 1576.1627 1602.1648 1610.1755 1621.7809 2275.7780 2935.5752 2975.3187 2976.7888 2982.7228 3052.8409 3054.7996 3084.9859 3087.2346 3119.9410 3128.1649 3136.7946 3142.1732 3149.8714 3152.7084 3158.9287 3170.0790
redmass: 3.0466 1.2676 3.1802 4.9513 1.0461 5.1011 4.7965 2.9280 5.5735 3.2524 3.4271 3.4552 3.3421 3.7561 3.5972 4.3621 4.6605 2.8468 6.7352 3.7459 5.5112 2.9933 5.7066 5.2132 3.6269 3.9389 6.6120 7.8432 2.0269 1.8664 5.6767 1.7323 1.4719 1.2470 1.3365 6.6120 1.4184 1.4381 2.7060 3.0592 1.3800 4.7991 5.8772 1.5895 1.3180 4.4493 1.5066 1.9873 2.3383 1.5254 1.5801 1.6021 1.6707 1.0546 1.4218 1.1136 1.0517 2.1464 1.4641 4.3964 1.3916 1.6336 5.2400 5.9370 1.2329 1.2810 2.1922 2.3631 2.0300 1.1015 1.0462 1.0456 2.1216 1.2788 1.4917 5.7675 5.7929 6.0552 6.4353 11.8727 1.0542 1.0373 1.0372 1.1047 1.0977 1.0976 1.0985 1.0987 1.0914 1.0847 1.0881 1.0908 1.0930 1.0922 1.0970 1.1017
irintensity: 0.2118 0.7840 0.1682 0.3628 0.2574 0.8022 0.4700 9.3604 0.1158 1.7747 2.0512 2.1910 0.7344 2.8657 0.6617 3.3176 0.0701 0.0034 3.3927 1.3312 1.5300 0.0015 0.0218 0.3354 12.5226 1.3363 0.2449 13.6519 11.8882 48.0675 0.7830 68.5285 32.2685 0.0052 19.5015 15.1061 5.2876 7.0536 29.3029 32.7575 0.0008 2.3540 2.2973 0.4587 0.2472 1.2952 1.5697 2.2026 186.1520 0.0282 25.7601 8.7305 178.4130 0.0100 11.0459 0.0105 0.4920 1.0512 6.9087 198.5030 0.1306 53.2209 1.3258 30.8188 15.8133 13.8945 11.3714 7.0734 0.1203 16.5216 17.9267 8.4137 78.6397 31.2604 10.9220 1.8854 180.6940 7.6235 77.5196 5.0698 28.0045 43.9622 33.7200 22.5811 20.6841 23.4660 20.2679 20.5534 24.1398 1.4914 3.5139 15.8037 20.5597 3.3148 30.3472 18.2843
temp: 298.150 k
press: 1.00000 atm
elementType: 8 6 6 6 6 6 6 6 6 6 6 6 6 6 6 6 6 6 1 1 1 1 1 1 1 1 1 1 1 1 1 1 1 1
symmnumber: 1
zpe: 717726.2 jmol-1
zpe.correction: 0.273367 hartree
zpe.thermalcorrener: 0.290980 hartree
zpe.thermalcorrenthalpy: 0.291924 hartree
zpe.thermalcorrgfe: 0.223100 hartree
zpe.sumelectzpe: -731.301765 hartree
zpe.sumelectthermal: -731.284153 hartree
zpe.sumelectthermalent: -731.283208 hartree
zpe.sumelectthermalfe: -731.352033 hartree
dipole: 0.0441 -1.3281 -0.0002
dipole: 1.3288
quadrupole: -82.6572 -92.3474 -112.5716
quadrupole: 1.4115 -0.0221 0.0370
quadrupole: 13.2016 3.5113 -16.7129 1.4115 -0.0221 0.0370
hfenergy: -731.5751328 hartree
pointgroup: C01 [X(C17H16O1)]
dipole: -0.0122904 -0.5226497 -0.0032246 debye
polarizability: 324.428105|-6.6418952|191.0638549|2.6834141|0.4116332|85.8983683 unknown
InChI: InChI=1S/C17H16O/c1-14-11-15(2)13-17(12-14)18-10-6-9-16-7-4-3-5-8-16/h3-5,7-8,11-13H,10H2,1-2H3
charge 0 multiplicity 1
34 atoms
O  0.977431 0.25098 0.095223
C  4.519258 -1.058969 0.131051
C  4.478754 1.412067 0.148948
C  5.193479 0.180794 0.148973
C  2.383978 0.141695 0.112408
C  3.097511 -1.077455 0.112537
C  3.070581 1.381609 0.13048
C  5.289382 -2.369624 0.131407
C  5.227481 2.734177 0.168406
C  0.217305 -1.019271 0.076129
C  -3.828277 -0.175403 0.036722
C  -4.801568 -1.216451 0.02737
C  -4.267876 1.18054 0.033082
C  -1.211819 -0.711604 0.061869
C  -6.176892 -0.905736 0.014772
C  -5.645046 1.481972 0.02062
C  -6.605298 0.442709 0.011406
C  -2.424815 -0.479141 0.049976
H  6.290507 0.196818 0.16315
H  2.581855 -2.043537 0.098758
H  2.481295 2.304388 0.129787
H  6.37879 -2.195301 0.144369
H  5.036051 -2.985307 1.015274
H  5.055436 -2.974475 -0.765177
H  4.534397 3.59254 0.167685
H  5.86863 2.8171 1.066205
H  5.888701 2.831906 -0.713213
H  0.476765 -1.619994 0.974234
H  0.497964 -1.605637 -0.825098
H  -4.46896 -2.259914 0.030103
H  -3.522361 1.982411 0.04028
H  -6.915571 -1.714871 0.007649
H  -5.970574 2.528113 0.018105
H  -7.674591 0.680767 0.001712
