program: Gaussian 09
title: 000258070
version: EM64L-G09RevD.01
frameworkgroup: C1[X(C16H17NO2)]
method: RPBEPBE
basis: SDD
operation: Freq
keyword: #p
keyword: freq=noraman
keyword: PBEPBE/SDD
title: #p freq=noraman PBEPBE/SDD
converged: YES YES NO NO
title: Mulliken charges:
elementType: O O N C C C C C C C C C C C C C C C C H H H H H H H H H H H H H H H H H
charge: -0.331951 -0.269483 -0.470211 -0.004730 -0.453301 -0.443135 -0.435449 -0.430828 0.247026 0.339339 0.157108 0.433627 -0.387292 -0.338861 -0.471318 -0.233130 -0.425204 -0.273716 -0.243688 0.265107 0.201902 0.240413 0.235888 0.228162 0.226227 0.216836 0.217544 0.214913 0.330895 0.301327 0.192757 0.238145 0.227340 0.239199 0.228485 0.230054
chargesum: 0.00000
title: Mulliken charges with hydrogens summed into heavy atoms:
elementType: O O N C C C C C C C C C C C C C C C C
charge: -0.331951 -0.269483 -0.139316 0.260378 -0.010986 0.020915 0.007614 0.001630 0.247026 0.339339 0.157108 0.433627 -0.085965 -0.146104 -0.233173 -0.005789 -0.186004 -0.045232 -0.013634
polarizability: 2.69109774e+02 1.04724930e+01 2.12454455e+02 7.33912087e+00 -2.72510092e+00 1.00042522e+02
1716.lowfreq: -25.7752 -6.5214 -1.3455 -0.0007 -0.0007 -0.0006 11.6584 18.6671 36.7802
frequency: -19.6538 18.4714 36.7133 55.3355 73.4466 84.3303 139.6639 165.1645 177.3726 200.6050 248.7325 271.4037 291.1234 380.8983 411.0500 418.7313 424.1151 471.7511 507.0596 512.2265 557.4818 563.1492 604.6258 625.4439 646.0747 657.7655 698.4354 703.0039 739.6909 741.4626 782.2631 782.8667 789.5302 807.5983 825.7451 850.0856 868.7489 869.4510 891.5047 903.3113 923.7475 929.1567 940.7487 951.4831 968.7788 985.3212 992.3015 1013.1117 1032.7415 1059.6203 1060.8720 1089.2601 1094.9571 1147.4636 1155.0988 1162.4549 1169.4896 1182.3189 1195.1301 1196.9506 1219.3301 1236.2925 1258.0129 1271.9727 1285.9429 1289.9091 1305.6689 1314.9840 1318.3470 1336.4478 1368.1484 1409.0272 1419.8869 1444.0613 1448.1676 1454.5354 1456.5927 1471.3557 1483.1761 1494.1216 1541.1399 1591.6505 1598.6274 1635.0239 1659.0110 2996.8876 2997.9893 3006.3789 3020.6760 3055.2004 3066.1096 3071.4540 3082.1211 3089.9893 3112.2030 3125.5720 3130.1349 3143.1101 3154.1383 3163.6663 3189.5711 3565.4426
redmass: 2.9533 3.0274 3.8666 7.0426 3.8534 4.4418 4.1591 2.6891 4.0695 5.2434 2.9114 3.9145 8.0601 2.8454 3.4307 3.0247 4.1852 3.3740 6.0604 6.7840 2.3560 2.0338 5.8445 1.5642 3.4049 3.5047 5.7743 4.2119 1.2945 3.4707 5.0372 2.0613 2.0226 1.4232 4.1457 2.0202 3.5148 2.0716 2.6998 2.3144 1.3558 3.0070 1.5420 1.4020 5.5366 1.3320 1.3573 1.4771 2.8971 2.6602 1.8805 1.7012 2.2389 1.9446 1.4253 1.6325 1.6771 1.1194 1.3362 1.3876 1.4260 1.8950 1.2755 1.6401 1.3361 2.3635 1.2605 1.3901 1.4733 1.3366 2.2647 2.8991 5.3422 2.5019 1.0933 2.1476 1.1203 1.0847 1.1121 2.5254 2.7844 7.3591 5.2948 6.3404 7.3049 1.0617 1.0651 1.0624 1.0633 1.0959 1.0925 1.1021 1.1004 1.1036 1.0863 1.0875 1.0868 1.0939 1.0967 1.1004 1.0944 1.0749
irintensity: 0.0276 0.0153 0.1944 3.8177 0.8170 1.7712 0.3347 2.1944 2.7812 2.1598 5.3353 4.0268 11.7506 2.2501 4.2867 12.4578 3.4821 0.1045 0.2403 0.4399 0.1130 3.0237 4.9480 35.3234 4.9280 2.8772 27.9900 10.8882 23.5716 3.5782 2.5639 70.5926 3.0806 73.8998 17.5836 9.2532 6.7963 14.6398 6.1419 4.9730 3.0504 2.6625 10.6610 1.6875 235.8106 0.9689 4.5400 2.3916 44.6306 111.5795 4.4744 15.0097 13.7410 406.9608 23.7178 2.6364 90.0564 9.4861 4.7162 6.1016 1.9691 3.9004 12.9836 21.8805 0.2499 19.1411 0.4177 0.6537 1.4302 34.9295 48.6887 30.6643 97.6441 3.5542 18.6275 1.4961 3.3477 7.9971 31.7904 361.6500 421.3959 49.6350 10.5938 12.2946 222.7350 39.6252 26.3377 37.6540 21.8317 30.0919 4.0426 22.6928 13.2665 99.7375 17.2114 0.8709 2.1052 32.3652 33.4871 28.3439 4.7557 25.7318
temp: 298.150 k
press: 1.00000 atm
elementType: 8 8 7 6 6 6 6 6 6 6 6 6 6 6 6 6 6 6 6 1 1 1 1 1 1 1 1 1 1 1 1 1 1 1 1 1
symmnumber: 1
zpe: 773562.3 jmol-1
zpe.correction: 0.294634 hartree
zpe.thermalcorrener: 0.310169 hartree
zpe.thermalcorrenthalpy: 0.311113 hartree
zpe.thermalcorrgfe: 0.249745 hartree
zpe.sumelectzpe: -823.766066 hartree
zpe.sumelectthermal: -823.750531 hartree
zpe.sumelectthermalent: -823.749587 hartree
zpe.sumelectthermalfe: -823.810956 hartree
dipole: -0.6943 2.3438 0.0855
dipole: 2.4460
quadrupole: -91.0819 -107.8734 -116.1824
quadrupole: -1.2986 1.5750 -0.6929
quadrupole: 13.9640 -2.8275 -11.1365 -1.2986 1.5750 -0.6929
hfenergy: -824.0607001 hartree
pointgroup: C01 [X(C16H17N1O2)]
dipole: 0.2764046 -0.8991966 0.2027782 debye
polarizability: 268.7374134|8.5378521|209.4277528|-12.1490019|-18.5265651|103.4415847 unknown
InChI: InChI=1S/C16H17NO2/c18-16(19-13-8-2-3-9-13)17-15-11-5-7-12-6-1-4-10-14(12)15/h1,4-7,10-11,13,17H,2-3,8-9H2
charge 0 multiplicity 1
36 atoms
O  2.452725 -0.212327 -0.439718
O  1.603207 1.977098 -0.662262
N  0.228624 0.085028 -0.230706
C  3.846105 0.318399 -0.637859
C  4.700608 -0.89052 -1.05773
C  4.435991 0.805243 0.71729
C  5.12344 -1.533838 0.286309
C  5.433782 -0.303833 1.184045
C  1.426069 0.749373 -0.460311
C  -1.080698 0.631281 -0.185125
C  -2.183955 -0.274556 0.078858
C  -3.526828 0.272809 0.120544
C  -1.319132 2.000386 -0.387952
C  -2.021085 -1.683767 0.301389
C  -3.735417 1.674561 -0.09238
C  -2.648267 2.512228 -0.339489
C  -4.631951 -0.60513 0.377422
C  -3.11805 -2.51341 0.55009
C  -4.439465 -1.970761 0.588282
H  3.779675 1.120538 -1.391626
H  5.594492 -0.518665 -1.59609
H  4.150852 -1.566849 -1.733471
H  3.616693 0.953529 1.441686
H  4.933871 1.782971 0.594242
H  5.984016 -2.218069 0.185177
H  4.276962 -2.110631 0.703766
H  5.332913 -0.531826 2.259481
H  6.476133 0.026807 1.014953
H  0.335727 -0.920364 -0.094563
H  -0.476308 2.665742 -0.583498
H  -1.028588 -2.150349 0.284521
H  -4.755934 2.071954 -0.056828
H  -2.80363 3.584242 -0.502005
H  -5.641033 -0.176923 0.405632
H  -2.964847 -3.585077 0.716948
H  -5.293098 -2.628591 0.783477
