program: Gaussian 09
title: 000257993
version: EM64L-G09RevD.01
frameworkgroup: C1[X(C16H16O2)]
method: RPBEPBE
basis: SDD
operation: Freq
keyword: #pfreq=noraman
keyword: PBEPBE/SDD
title: #p freq=noraman PBEPBE/SDD
converged: YES YES NO NO
title: Mulliken charges:
elementType: O O C C C C C C C C C C C C C C C C H H H H H H H H H H H H H H H H
charge: -0.266124 -0.269805 0.341476 -0.378182 0.491418 -0.184817 -0.321187 -0.342223 -0.348065 0.314178 -0.356712 -0.327691 -0.385989 -0.397109 -0.236299 -0.235676 -0.240821 -0.536963 0.213925 0.209268 0.236599 0.245676 0.251716 0.218820 0.236787 0.250871 0.226554 0.227628 0.226309 0.227255 0.230118 0.243555 0.217711 0.217801
chargesum: 0.00000
title: Mulliken charges with hydrogens summed into heavy atoms:
elementType: O O C C C C C C C C C C C C C C C C
charge: -0.266124 -0.269805 0.341476 0.045011 0.491418 0.051782 -0.102367 -0.096547 -0.096349 0.314178 -0.119925 -0.076820 -0.159435 -0.169481 -0.009990 -0.008421 -0.010703 0.142103
polarizability: 3.31369567e+02 5.66444779e+00 1.53369670e+02 -1.12791854e+01 6.27086430e+00 1.01488253e+02
1716.lowfreq: -14.0144 -4.0366 -2.6696 0.0002 0.0006 0.0007 18.3263 23.2247 33.2657
frequency: 18.3100 23.2210 33.2532 69.6647 81.8295 98.8645 114.7280 161.5943 165.6626 220.9374 226.6248 242.0762 277.8721 352.4483 364.9834 385.6425 403.1417 418.0979 436.2042 486.6310 503.7386 516.1558 543.3647 616.0040 617.7719 629.1838 695.3676 712.2381 714.1292 761.9260 788.3077 802.5352 823.4405 828.7462 845.3415 859.4860 901.3750 923.2971 953.8890 954.7966 976.5380 981.2777 985.1703 989.3316 991.7812 997.4866 998.5797 1027.8754 1080.1629 1109.6668 1112.5412 1123.8328 1154.3270 1172.8596 1174.5767 1189.6894 1193.4550 1196.2197 1225.7808 1232.6791 1289.0148 1297.0700 1300.4629 1335.6583 1360.1359 1380.7420 1389.0096 1425.1981 1434.8641 1441.1956 1464.5322 1469.4586 1474.9163 1486.0840 1495.3846 1585.4439 1587.9511 1612.6851 1625.2044 1672.9019 2926.9576 2952.1562 2994.9631 3036.8067 3079.0782 3117.5806 3121.0794 3122.7683 3127.0746 3138.6547 3146.7863 3149.0808 3153.9329 3165.3005 3167.5000 3175.5403
redmass: 5.4149 3.6357 5.1290 3.7960 3.3003 4.0391 4.6781 2.8658 3.6882 3.9138 2.9998 1.2047 3.6101 3.7555 5.3167 5.4351 2.7793 3.0651 3.9563 3.9342 3.2079 2.3396 5.2290 6.3657 4.6265 6.7201 1.8754 3.9908 3.5705 1.7765 1.3462 5.1194 2.9092 1.6204 1.4349 1.8350 1.3854 1.4948 6.7833 1.3486 1.3673 1.2240 2.5520 6.1810 3.0634 2.4917 1.3866 2.1158 1.7272 1.2688 1.2607 2.3625 1.3422 1.0640 1.2622 1.2331 2.0666 1.1702 2.0821 4.7269 1.3443 1.2934 1.5162 1.2497 1.6390 5.1242 4.4109 3.8422 1.1722 2.2380 1.0508 1.1476 1.0821 2.3020 2.1754 5.8269 7.6669 5.9993 6.4026 6.1428 1.0579 1.0333 1.1026 1.1036 1.0901 1.0872 1.0987 1.0891 1.0867 1.0912 1.0868 1.0960 1.0878 1.1015 1.0953 1.0975
irintensity: 0.1201 0.8908 0.3237 0.2458 2.0602 1.6262 0.3543 8.9016 1.9843 3.9936 1.8939 0.3560 4.9824 1.7566 1.0737 2.1769 0.0203 0.0581 2.6372 8.0288 8.1685 19.5944 0.6824 0.0435 2.6146 0.0174 35.4057 61.7066 3.0523 58.3134 21.3636 4.4808 2.3287 73.7374 2.6954 7.7541 0.0814 0.6425 164.4521 1.9499 3.1897 45.7236 0.8324 25.7514 5.4955 50.9621 14.5463 5.3543 8.6505 17.0423 0.1987 6.0160 3.6042 1.2018 11.7245 147.5432 452.1013 26.0699 1.3005 6.1784 4.1185 9.2437 5.0080 2.5315 39.3498 15.5659 23.4918 2.8663 24.0754 13.5575 13.6886 90.4609 46.4095 27.8542 253.4172 1.6851 15.5120 3.0234 3.2587 8.8423 34.2575 75.2429 32.1689 55.3377 19.6359 7.8700 31.8237 18.6079 4.6104 9.1723 24.5567 43.5956 4.6167 27.1539 15.1790 2.8977
temp: 298.150 k
press: 1.00000 atm
elementType: 8 8 6 6 6 6 6 6 6 6 6 6 6 6 6 6 6 6 1 1 1 1 1 1 1 1 1 1 1 1 1 1 1 1
symmnumber: 1
zpe: 718895.2 jmol-1
zpe.correction: 0.273813 hartree
zpe.thermalcorrener: 0.290474 hartree
zpe.thermalcorrenthalpy: 0.291419 hartree
zpe.thermalcorrgfe: 0.226741 hartree
zpe.sumelectzpe: -768.413486 hartree
zpe.sumelectthermal: -768.396824 hartree
zpe.sumelectthermalent: -768.395880 hartree
zpe.sumelectthermalfe: -768.460558 hartree
dipole: 0.5198 -2.6348 1.2185
dipole: 2.9491
quadrupole: -87.3194 -97.4199 -109.2135
quadrupole: 11.4956 -4.8828 2.1728
quadrupole: 10.6648 0.5644 -11.2292 11.4956 -4.8828 2.1728
hfenergy: -768.6872988 hartree
pointgroup: C01 [X(C16H16O2)]
dipole: -0.2254396 1.0560597 0.4243964 debye
polarizability: 330.9125316|9.2246055|152.8543257|13.0618338|-8.6032335|102.4606329 unknown
InChI: InChI=1S/C16H16O2/c1-17-15-9-11-16(12-10-15)18-13-5-8-14-6-3-2-4-7-14/h2-12H,13H2,1H3
charge 0 multiplicity 1
34 atoms
O  0.796536 -0.573306 0.027751
O  6.414406 -0.118698 -0.170512
C  2.188002 -0.346548 0.023881
C  -0.060701 0.52074 0.535836
C  -3.933176 0.271813 -0.052771
C  -1.47468 0.017244 0.556365
C  -2.508535 0.661012 -0.055107
C  2.8151 0.857236 0.418018
C  2.978044 -1.437873 -0.424302
C  5.008854 -0.11794 -0.07835
C  4.227379 0.971625 0.367072
C  4.374949 -1.324902 -0.47529
C  -4.427694 -0.876741 0.63047
C  -4.86313 1.078504 -0.767524
C  -5.797664 -1.202904 0.593788
C  -6.235844 0.753593 -0.804191
C  -6.710402 -0.390308 -0.122889
C  7.108778 1.106704 0.222038
H  0.038004 1.41624 -0.112214
H  0.280371 0.786957 1.561076
H  -1.631334 -0.913154 1.117026
H  2.231036 1.716162 0.761295
H  2.474612 -2.36075 -0.727709
H  -2.276896 1.577156 -0.620521
H  4.692648 1.912628 0.675838
H  4.997178 -2.156741 -0.818771
H  -3.739156 -1.517871 1.191899
H  -4.500137 1.966882 -1.299805
H  -6.159182 -2.091209 1.124095
H  -6.932637 1.389181 -1.361918
H  -7.775188 -0.646966 -0.147998
H  8.177759 0.894234 0.07268
H  6.923641 1.35391 1.286424
H  6.807359 1.963691 -0.412781
