program: Gaussian 09
title: 000257990
version: EM64L-G09RevD.01
frameworkgroup: C1[X(C16H15NO3)]
method: RPBEPBE
basis: SDD
operation: Freq
keyword: #p
keyword: freq=noraman
keyword: PBEPBE/SDD
title: #p freq=noraman PBEPBE/SDD
converged: YES YES NO NO
title: Mulliken charges:
elementType: O O O N C C C C C C C C C C C C C C C C H H H H H H H H H H H H H H H
charge: -0.269611 -0.203825 -0.205225 0.022279 0.540604 0.350877 0.440468 -0.378221 -0.324534 -0.521638 -0.335704 -0.373168 -0.424446 -0.331201 -0.175229 0.365092 -0.395702 -0.368303 -0.197592 -0.807961 0.215421 0.220799 0.231426 0.287175 0.245549 0.248080 0.227761 0.230593 0.237423 0.238087 0.289291 0.239930 0.228836 0.223120 0.229549
chargesum: 0.00000
title: Mulliken charges with hydrogens summed into heavy atoms:
elementType: O O O N C C C C C C C C C C C C C C C C
charge: -0.269611 -0.203825 -0.205225 0.022279 0.540604 0.350877 0.440468 0.057998 -0.093108 -0.234462 -0.090155 -0.125088 -0.196685 -0.100609 0.062194 0.365092 -0.157616 -0.079012 0.042338 -0.126455
polarizability: 3.54970508e+02 1.93769054e+00 1.77215418e+02 7.23065241e+00 9.72326690e+00 1.04129232e+02
1716.lowfreq: -11.5507 -4.7331 -2.1931 0.0001 0.0004 0.0009 11.7911 22.8241 31.1724
frequency: 11.2964 22.8191 31.1566 47.2039 51.8527 71.1639 84.7229 121.8927 148.1567 150.9052 166.6459 182.2764 246.2845 272.7855 318.2839 329.7510 362.6649 367.5339 413.6159 417.5613 425.6861 447.0812 507.2622 515.7168 526.7982 550.4086 624.9735 634.4108 667.3939 680.2724 702.5688 710.5490 731.9933 767.9740 804.9697 811.2788 819.2504 828.7893 844.7011 893.4477 929.4125 934.6447 947.4491 962.3407 963.4553 985.5535 987.0199 988.0088 994.9031 1001.4868 1005.6344 1047.0100 1088.9699 1091.2279 1121.1653 1122.4529 1178.1815 1179.7523 1194.0667 1210.4848 1212.9790 1223.3157 1232.7288 1286.5879 1295.9572 1305.7691 1320.6528 1356.1863 1373.0062 1375.3240 1398.9102 1400.2269 1413.8161 1438.2863 1467.1246 1470.5044 1477.3695 1481.7956 1501.7915 1580.4860 1586.5747 1616.4925 1625.5972 1676.7337 2930.5463 2974.0412 3001.6623 3050.7460 3081.5949 3092.2297 3123.0117 3124.2601 3125.2509 3144.5856 3158.4966 3163.6726 3163.8751 3166.7557 3189.5929
redmass: 4.7154 4.9500 5.2506 1.1312 6.1078 4.8262 3.7459 4.9913 3.4796 4.1254 4.6828 3.2848 4.8984 3.3810 3.3819 4.0426 4.3551 5.2639 2.9774 6.4166 3.2234 4.1119 2.5060 5.6670 4.7083 5.5322 5.2310 6.6238 7.2732 2.4002 4.0186 3.0112 4.9309 7.5579 1.5566 2.3940 2.0040 1.3615 1.8230 4.2355 1.3335 1.5288 1.4297 5.5375 1.3509 1.4685 2.6271 1.5024 2.0085 1.3469 2.6054 1.5292 1.6798 1.9586 1.3074 2.3195 1.3885 1.1770 1.0886 2.7476 2.7509 3.9911 2.9867 1.2660 1.6560 1.2937 1.2734 1.6946 7.4092 4.1590 1.3431 3.2590 3.4976 3.1683 1.1171 1.0458 1.0979 2.6778 2.5543 6.2378 6.4582 6.8394 6.4263 6.1285 1.0587 1.0372 1.1017 1.0977 1.0984 1.0911 1.0892 1.0897 1.0890 1.0873 1.0942 1.0940 1.0955 1.0927 1.0963
irintensity: 1.3660 0.9002 0.5128 0.9653 0.3237 1.4816 2.4846 0.5037 1.6829 0.6012 1.9340 0.9528 1.3518 2.9480 2.5309 3.2507 0.4142 3.2596 0.0119 0.5874 0.2990 0.1018 21.2805 5.6603 2.1431 9.1497 0.5768 0.3301 18.0450 11.8858 32.3384 0.5215 18.9204 15.1756 52.2888 7.3011 20.5944 33.2114 3.0515 12.9402 1.0234 1.1554 10.2428 146.8792 0.7262 12.9393 20.6929 25.3538 2.4275 10.5422 7.7979 11.1187 13.5588 21.0581 13.5366 8.2180 197.2091 7.1692 10.4465 381.8648 60.8157 40.9340 77.3535 6.5575 4.6476 2.4555 2.8302 36.3428 98.4893 26.7174 2.1642 37.7152 3.1404 24.5079 26.8136 12.4443 12.8369 46.2373 163.9530 2.2056 21.8143 11.2291 40.4725 0.6871 33.1766 51.9874 27.8435 23.5738 19.8712 12.9935 18.0144 21.3482 26.8560 4.8301 21.1415 8.4593 4.2394 6.8612 5.2050
temp: 298.150 k
press: 1.00000 atm
elementType: 8 8 8 7 6 6 6 6 6 6 6 6 6 6 6 6 6 6 6 6 1 1 1 1 1 1 1 1 1 1 1 1 1 1 1
symmnumber: 1
zpe: 710915.9 jmol-1
zpe.correction: 0.270774 hartree
zpe.thermalcorrener: 0.289290 hartree
zpe.thermalcorrenthalpy: 0.290234 hartree
zpe.thermalcorrgfe: 0.219888 hartree
zpe.sumelectzpe: -897.595141 hartree
zpe.sumelectthermal: -897.576624 hartree
zpe.sumelectthermalent: -897.575680 hartree
zpe.sumelectthermalfe: -897.646026 hartree
dipole: -4.3303 2.3625 -1.8929
dipole: 5.2836
quadrupole: -141.2396 -111.9388 -118.0775
quadrupole: 21.9530 -4.4973 3.6465
quadrupole: -17.4876 11.8132 5.6745 21.9530 -4.4973 3.6465
hfenergy: -897.8659141 hartree
pointgroup: C01 [X(C16H15N1O3)]
dipole: 1.6646854 0.8333076 0.9249126 debye
polarizability: 354.0271906|-2.1638174|178.4673989|17.0204433|-0.2129373|103.8205678 unknown
InChI: InChI=1S/C16H15NO3/c1-13-7-9-16(10-8-13)20-11-3-5-14-4-2-6-15(12-14)17(18)19/h2-10,12H,11H2,1H3
charge 0 multiplicity 1
35 atoms
O  2.353953 0.576967 -0.023656
O  -7.096446 -0.574741 -0.844263
O  -5.58256 -2.268818 -1.033558
N  -5.897019 -1.045353 -0.765949
C  -2.444008 0.24265 0.149801
C  3.717937 0.222805 0.034058
C  6.523746 -0.299256 0.016142
C  1.403714 -0.286609 0.705015
C  -1.074438 -0.305003 0.227379
C  -3.496785 -0.618741 -0.255032
C  4.227537 -0.9205 0.693398
C  4.60127 1.104954 -0.636238
C  5.622109 -1.165849 0.676325
C  5.982544 0.840885 -0.640991
C  0.051698 0.360593 0.605427
C  -4.812063 -0.12179 -0.341058
C  -2.765644 1.597852 0.457719
C  -5.136871 1.21718 -0.039274
C  -4.088864 2.073727 0.362813
C  8.018888 -0.568832 0.001105
H  1.726971 -0.356744 1.767445
H  1.396983 -1.307751 0.271918
H  -0.978354 -1.364247 -0.053871
H  -3.307871 -1.667442 -0.504608
H  3.567879 -1.623001 1.21167
H  4.185126 1.981846 -1.141958
H  6.0090 -2.054665 1.189396
H  6.655912 1.53149 -1.16365
H  0.028528 1.423151 0.880044
H  -1.974084 2.286054 0.771645
H  -6.171958 1.557646 -0.121261
H  -4.308783 3.11885 0.603074
H  8.584943 0.265403 0.457237
H  8.269347 -1.487386 0.559503
H  8.397361 -0.690927 -1.031544
