program: Gaussian 09
title: 000257987
version: EM64L-G09RevD.01
frameworkgroup: C1[X(C15H14O3)]
method: RPBEPBE
basis: SDD
operation: Freq
keyword: #pfreq=noraman
keyword: PBEPBE/SDD
title: #p freq=noraman PBEPBE/SDD
converged: YES YES NO NO
title: Mulliken charges:
elementType: O O O C C C C C C C C C C C C C C C H H H H H H H H H H H H H H
charge: -0.265911 -0.441733 -0.254707 -0.711221 0.516514 0.505600 -0.442164 -0.367335 -0.350426 -0.458630 0.247477 -0.352870 -0.327654 -0.351779 -0.351964 0.312252 0.109797 -0.537778 0.227625 0.231658 0.238395 0.250951 0.241568 0.230138 0.269763 0.272565 0.250504 0.239893 0.245891 0.220210 0.220570 0.382802
chargesum: 0.00000
title: Mulliken charges with hydrogens summed into heavy atoms:
elementType: O O O C C C C C C C C C C C C C C C
charge: -0.265911 -0.058931 -0.254707 -0.251938 0.516514 0.505600 -0.203770 -0.116384 -0.108858 -0.228492 0.247477 -0.083106 -0.055088 -0.101276 -0.112070 0.312252 0.109797 0.148893
polarizability: 2.62888321e+02 5.95227728e+00 1.46579748e+02 2.18175867e+01 3.26276121e+00 1.21011531e+02
1716.lowfreq: -6.3889 -2.0416 -0.0007 -0.0005 -0.0002 6.4051 20.8276 25.7926 38.9882
frequency: 20.7479 25.6243 38.9720 75.0132 86.7258 101.7515 141.6888 171.0783 200.1325 232.9318 257.9871 284.9217 309.4823 331.5518 387.9577 406.0736 415.4953 430.4608 476.1565 483.0540 510.1362 539.7894 584.5786 596.9093 631.0421 632.4078 683.1371 696.9272 722.6871 730.1622 761.5310 799.9139 817.7660 829.0325 834.1978 863.4987 863.7829 927.3031 950.4273 968.9501 988.7984 991.1185 997.1234 1001.1252 1004.1463 1024.0188 1111.1381 1112.6323 1117.8810 1149.4624 1156.7990 1181.4691 1183.9920 1194.6032 1196.4000 1220.1118 1232.2643 1283.6661 1309.4569 1318.7048 1322.2745 1382.7600 1388.0791 1413.5956 1418.3116 1436.4362 1456.7051 1466.2724 1473.1273 1501.2430 1503.6067 1574.5833 1585.4219 1620.0289 1625.1960 1641.9234 2958.0474 2968.0164 3013.8678 3045.3717 3118.0477 3124.8442 3126.3553 3128.3812 3138.6782 3160.1405 3160.3291 3165.8234 3175.8278 3532.4845
redmass: 4.9342 4.3999 5.0550 6.2228 3.6728 5.4629 5.0838 5.0856 3.2465 1.1961 5.4217 4.4558 3.4601 2.9252 5.7678 2.8497 2.9754 3.8863 3.2529 5.4120 2.9131 4.4806 1.6728 2.2001 6.9077 6.6386 4.0015 3.4258 4.4797 3.1799 4.1586 2.8133 1.5357 4.6987 1.5581 1.6259 1.3500 1.5248 1.6628 1.3792 4.9903 1.5793 1.3828 4.4477 2.8355 2.7566 1.3770 1.2650 1.3487 1.7280 1.3372 1.2311 1.1487 1.4068 2.0877 1.9254 3.9678 1.5832 1.3125 2.1568 1.8073 4.4963 4.9426 3.1956 3.3094 1.1695 1.1103 1.0502 1.0753 2.6048 2.4343 7.2406 6.9001 6.3100 6.4006 8.5614 1.0331 1.0596 1.1000 1.1039 1.0895 1.0991 1.0892 1.0893 1.0897 1.0952 1.0937 1.0955 1.0952 1.0641
irintensity: 0.3320 0.4915 0.4639 0.7791 4.3822 0.6971 1.4394 2.2969 2.1028 0.1275 0.2626 2.6597 0.0304 3.3154 14.8138 0.6043 0.0641 5.2688 22.8297 14.9255 21.4517 31.2871 74.7535 25.6747 1.4749 1.2883 43.9914 37.3648 5.4547 16.2967 18.7194 30.3907 8.4065 2.1569 50.5463 17.7425 6.1116 8.3902 8.5362 0.7609 38.1719 5.4902 0.4106 192.1145 20.0635 103.1547 12.4700 0.5989 11.6552 130.7160 1.6039 56.4367 14.1343 0.9893 0.7802 47.7359 144.6987 3.1351 5.4556 78.7122 38.3673 9.7614 5.3708 17.8135 4.4545 9.7758 15.3935 13.4660 59.7931 34.5010 115.3986 13.2987 17.0846 68.9956 55.9842 338.0367 72.6778 26.7949 12.1198 49.8459 20.2094 22.5837 11.6000 13.0414 8.0437 6.6707 16.2999 3.8884 1.4922 45.5971
temp: 298.150 k
press: 1.00000 atm
elementType: 8 8 8 6 6 6 6 6 6 6 6 6 6 6 6 6 6 6 1 1 1 1 1 1 1 1 1 1 1 1 1 1
symmnumber: 1
zpe: 659278.0 jmol-1
zpe.correction: 0.251106 hartree
zpe.thermalcorrener: 0.267240 hartree
zpe.thermalcorrenthalpy: 0.268185 hartree
zpe.thermalcorrgfe: 0.205114 hartree
zpe.sumelectzpe: -804.389165 hartree
zpe.sumelectthermal: -804.373030 hartree
zpe.sumelectthermalent: -804.372086 hartree
zpe.sumelectthermalfe: -804.435157 hartree
dipole: -3.6511 0.1771 -2.1144
dipole: 4.2229
quadrupole: -102.2044 -98.1092 -103.4370
quadrupole: -3.9700 5.1342 1.8647
quadrupole: -0.9542 3.1410 -2.1868 -3.9700 5.1342 1.8647
hfenergy: -804.6402705 hartree
pointgroup: C01 [X(C15H14O3)]
dipole: 1.3848643 0.2153512 -0.892231 debye
polarizability: 258.5195777|19.0493729|149.0165217|-26.5016128|-0.0968932|122.943501 unknown
InChI: InChI=1S/C15H14O3/c1-18-14-8-4-12(5-9-14)10-11-2-6-13(7-3-11)15(16)17/h2-9,16H,10H2,1H3
charge 0 multiplicity 1
32 atoms
O  4.984197 1.497375 0.694187
O  -5.032705 1.864706 0.126583
O  -5.827268 -0.149541 0.963822
C  0.403252 -1.699068 -0.779414
C  -0.957426 -1.097802 -0.430142
C  1.609647 -0.832015 -0.428759
C  -1.973865 -1.905411 0.144293
C  -1.248788 0.264713 -0.706841
C  1.794223 -0.337764 0.892353
C  2.592649 -0.522144 -1.395433
C  -3.528102 -0.014254 0.143356
C  -3.246384 -1.374767 0.429736
C  -2.518294 0.804495 -0.427423
C  2.920106 0.430543 1.23275
C  3.7348 0.250169 -1.074384
C  3.898135 0.726661 0.248479
C  -4.882161 0.505528 0.458333
C  6.025092 1.82484 -0.282252
H  0.489522 -2.683208 -0.276936
H  0.425309 -1.911696 -1.867591
H  -1.762287 -2.957622 0.369965
H  -0.46724 0.9019 -1.135446
H  1.041804 -0.555595 1.659725
H  2.472709 -0.888726 -2.422729
H  -4.033985 -1.992102 0.874363
H  -2.741465 1.853096 -0.643414
H  3.06733 0.811283 2.248088
H  4.473713 0.468553 -1.851221
H  6.76604 2.416463 0.2751
H  5.618933 2.427609 -1.118112
H  6.503481 0.909948 -0.683553
H  -5.957471 2.145036 0.361915
