program: Gaussian 09
title: 000257981
version: EM64L-G09RevD.01
frameworkgroup: C1[X(C14H16N2)]
method: RPBEPBE
basis: SDD
operation: Freq
keyword: #pfreq=noraman
keyword: PBEPBE/SDD
title: #p freq=noraman PBEPBE/SDD
converged: YES YES NO NO
title: Mulliken charges:
elementType: N N C C C C C C C C C C C C C C H H H H H H H H H H H H H H H H
charge: -0.417015 -0.417015 0.360576 0.360577 -0.406956 -0.406956 -0.386124 -0.386125 0.452631 0.452631 -0.387601 -0.387602 -0.435466 -0.435466 -0.636668 -0.636668 0.226447 0.226447 0.227137 0.227137 0.228893 0.228893 0.207616 0.207616 0.292320 0.292319 0.228477 0.218150 0.227584 0.228477 0.218150 0.227583
chargesum: 0.00000
title: Mulliken charges with hydrogens summed into heavy atoms:
elementType: N N C C C C C C C C C C C C C C
charge: -0.124696 -0.124696 0.360576 0.360577 -0.180508 -0.180509 -0.158988 -0.158988 0.452631 0.452631 -0.158708 -0.158708 -0.227849 -0.227850 0.037542 0.037542
polarizability: 3.42481076e+02 -1.80775682e-05 1.53045273e+02 1.51191551e+00 -1.19599547e-05 8.26651948e+01
1716.lowfreq: -4.7085 -2.5025 0.0001 0.0007 0.0008 5.6046 39.9803 53.3403 70.6947
frequency: 39.9740 53.3402 70.6920 96.4679 106.5465 138.1025 153.6064 181.2139 192.5456 213.4918 262.6973 273.3158 318.3310 321.8733 390.9787 394.5065 412.0704 414.6158 458.5670 486.5299 513.2026 543.8873 561.1947 631.0626 639.3137 664.8454 720.2769 738.5724 786.6433 803.3896 809.2391 812.8332 812.9626 829.7680 930.2839 937.8306 946.5729 947.0849 980.7899 997.9067 1020.8881 1073.6007 1076.7068 1113.7775 1115.5759 1124.8356 1124.8431 1166.6536 1167.8062 1193.5025 1207.6871 1290.2727 1293.1411 1303.0663 1307.7929 1319.9804 1352.7150 1367.3643 1417.1097 1428.8857 1446.7749 1449.5771 1463.3805 1463.3912 1463.5691 1474.9197 1501.7083 1503.7636 1517.2620 1545.1003 1569.1852 1580.8744 1634.3262 1638.9561 2936.2721 2936.9754 2996.0362 2996.0633 3088.4099 3088.4596 3104.0263 3105.4467 3122.8051 3127.4735 3135.7512 3140.0896 3154.5020 3155.9617 3593.4190 3593.7008
redmass: 3.9927 3.2423 3.5715 3.6604 3.4787 1.6954 1.1505 1.7409 3.0149 3.9527 3.1579 4.1477 1.1111 1.1828 4.7283 5.7715 2.9785 3.0043 4.2608 3.6975 2.6209 2.0929 4.1918 6.8811 6.6418 4.6011 3.3193 3.5678 4.3831 1.9741 1.3225 1.6300 2.0715 1.8707 1.3450 1.4107 1.3534 1.3572 5.4759 2.9419 2.7053 2.2820 2.0755 1.7764 1.5129 1.2766 1.2766 1.5825 1.5996 1.1255 1.1270 1.8612 1.5962 1.4862 2.8233 1.6643 3.1518 4.6903 2.7279 3.1420 1.2308 1.2769 1.0419 1.0481 1.7585 1.8049 1.1188 1.0750 2.5794 3.5071 4.0959 5.2241 6.3476 6.4724 1.0378 1.0379 1.1008 1.1008 1.0953 1.0952 1.0871 1.0876 1.0877 1.0868 1.0952 1.0941 1.0947 1.0949 1.0774 1.0775
irintensity: 5.1718 0.4003 1.4558 0.0029 13.7781 1.2096 5.5608 0.0004 0.0042 0.0543 2.9330 1.0404 11.8596 200.0689 0.3499 0.0175 0.9654 0.0003 1.4273 2.6429 27.3262 4.3617 22.2914 1.3908 0.6598 0.0017 2.3499 0.5329 9.1472 0.2224 29.5124 135.8201 0.0176 13.4005 0.2047 0.1532 0.3749 0.0470 0.0077 0.0743 0.2317 19.0025 2.3219 6.0648 4.6229 0.1753 3.6694 1.4182 18.8218 68.1295 0.9413 0.8115 46.4087 10.9538 2.5392 95.6785 20.6493 86.9470 16.5501 8.1636 24.5244 0.5823 22.1855 1.9085 0.7597 0.1057 7.7045 0.5482 774.5043 3.4993 3.3587 2.4137 3.1746 403.0488 187.9123 93.4488 8.2491 109.1558 56.1415 7.3371 52.7026 11.4245 30.3563 3.8205 6.2219 44.5706 17.5169 19.9125 92.6459 11.3610
temp: 298.150 k
press: 1.00000 atm
elementType: 7 7 6 6 6 6 6 6 6 6 6 6 6 6 6 6 1 1 1 1 1 1 1 1 1 1 1 1 1 1 1 1
symmnumber: 1
zpe: 697312.3 jmol-1
zpe.correction: 0.265592 hartree
zpe.thermalcorrener: 0.281128 hartree
zpe.thermalcorrenthalpy: 0.282072 hartree
zpe.thermalcorrgfe: 0.222664 hartree
zpe.sumelectzpe: -651.444241 hartree
zpe.sumelectthermal: -651.428705 hartree
zpe.sumelectthermalent: -651.427761 hartree
zpe.sumelectthermalfe: -651.487170 hartree
dipole: 0.0000 0.1949 0.0000
dipole: 0.1949
quadrupole: -48.6552 -84.8675 -102.9861
quadrupole: 0.0000 1.2822 0.0000
quadrupole: 30.1811 -6.0312 -24.1499 0.0000 1.2822 0.0000
hfenergy: -651.7098332 hartree
pointgroup: C01 [X(C14H16N2)]
dipole: 0.000001 -0.076699 -0.0000046 debye
polarizability: 342.2630196|0.0000452|153.0452727|-7.6741655|0.0001884|82.883251 unknown
InChI: InChI=1S/C14H16N2/c1-15-13-7-3-11(4-8-13)12-5-9-14(16-2)10-6-12/h3-10,15-16H,1-2H3
charge 0 multiplicity 1
32 atoms
N  5.026358 -0.161498 -0.230354
N  -5.026364 -0.1615 0.230355
C  0.742964 -0.137213 -0.031749
C  -0.742971 -0.137213 0.031748
C  1.50402 1.030224 0.249719
C  -1.504026 1.030225 -0.249714
C  1.475133 -1.309839 -0.379966
C  -1.475139 -1.309841 0.379958
C  3.630631 -0.137603 -0.159825
C  -3.630637 -0.137604 0.159824
C  2.911471 1.043153 0.18852
C  -2.911478 1.043154 -0.188515
C  2.877959 -1.317562 -0.442595
C  -2.877965 -1.317564 0.442587
C  5.870872 0.998131 0.033175
C  -5.870878 0.998131 -0.033169
H  0.985934 1.947108 0.555055
H  -0.985941 1.947111 -0.555045
H  0.932551 -2.226826 -0.638125
H  -0.932556 -2.22683 0.638111
H  3.450033 1.966561 0.424825
H  -3.450039 1.966562 -0.424815
H  3.404757 -2.23847 -0.726233
H  -3.404763 -2.238474 0.72622
H  5.472855 -1.043605 -0.471539
H  -5.472861 -1.043609 0.471528
H  5.654225 1.835117 -0.662629
H  6.928925 0.715805 -0.097199
H  5.745918 1.378673 1.06843
H  -5.654226 1.835115 0.662634
H  -6.928931 0.715806 0.09721
H  -5.745929 1.378674 -1.068425
