program: Gaussian 09
title: 000257968
version: EM64L-G09RevD.01
frameworkgroup: C1[X(C13H12N2O2)]
method: RPBEPBE
basis: SDD
operation: Freq
keyword: #p
keyword: freq=noraman
keyword: PBEPBE/SDD
title: #p freq=noraman PBEPBE/SDD
converged: YES YES NO NO
title: Mulliken charges:
elementType: O O N N C C C C C C C C C C C C C H H H H H H H H H H H H
charge: -0.207640 -0.207640 -0.044813 0.026006 0.375437 0.362411 -0.440746 -0.440744 0.121863 0.121862 -0.364749 -0.364750 0.380626 -0.374647 -0.374650 -0.786884 -0.786883 0.245139 0.245138 0.254055 0.254055 0.287181 0.287181 0.257001 0.228559 0.231035 0.228560 0.231034 0.257001
chargesum: 0.00000
title: Mulliken charges with hydrogens summed into heavy atoms:
elementType: O O N N C C C C C C C C C C C C C
charge: -0.207640 -0.207640 -0.044813 0.026006 0.375437 0.362411 -0.195607 -0.195606 0.121863 0.121862 -0.110695 -0.110695 0.380626 -0.087466 -0.087468 -0.070288 -0.070287
polarizability: 2.85160262e+02 2.55131856e-04 1.71013383e+02 -1.79950262e-04 9.25714138e+00 8.23113476e+01
1716.lowfreq: -42.1858 -38.0077 -6.1554 -4.9580 -1.7991 -0.0006 0.0005 0.0006 40.3553
frequency: -41.8838 -37.9414 40.2189 45.7260 74.3921 78.5206 144.7213 185.9725 204.6928 214.6883 219.3843 285.9326 295.4727 333.0922 411.4943 447.6471 450.7067 496.4740 524.2642 538.6272 542.7962 557.7870 599.7933 630.3207 670.4182 671.2997 735.8036 747.0536 779.8790 836.5730 850.2887 858.0412 892.6887 895.5402 955.9928 957.1174 977.6086 989.9698 994.9026 1004.7447 1022.1984 1042.0982 1054.1704 1080.6023 1095.5718 1115.3421 1186.0460 1210.9803 1223.1182 1227.4622 1295.9874 1305.5399 1349.7049 1352.5010 1379.4343 1388.9990 1392.1913 1394.8408 1411.5435 1425.2965 1460.2900 1468.8682 1469.4725 1470.4973 1489.2679 1550.6709 1591.3625 1593.0670 1609.4487 2984.5892 2984.9420 3062.7737 3062.9692 3119.1019 3119.3063 3140.8775 3143.4008 3152.6336 3154.6581 3183.3178 3185.9371
redmass: 1.0223 1.0159 5.8734 6.6237 5.2192 5.2417 5.5017 3.0516 4.6376 5.1154 5.3126 3.0984 5.8851 4.2547 2.9169 3.4963 8.1804 5.8348 3.8128 5.0585 2.7340 4.8434 4.7511 6.7933 8.3970 4.3877 3.1344 3.4848 9.2597 5.2712 1.2537 1.5031 1.6467 1.3331 4.0294 2.8620 1.9920 1.3618 1.3972 2.9822 1.8972 1.5848 1.6014 1.9369 2.9778 1.3149 1.4881 2.2398 3.7089 1.5304 2.1811 2.0063 3.4316 5.1621 5.6144 1.3198 1.6351 2.0611 5.2754 3.6523 1.1212 1.1807 1.0501 1.0470 2.5572 6.6752 7.9539 5.5396 6.1888 1.0383 1.0382 1.0974 1.0973 1.0981 1.0982 1.0917 1.0926 1.0894 1.0898 1.0948 1.0961
irintensity: 0.0084 0.8769 0.0107 1.7960 0.0163 1.5905 3.0880 0.1341 5.6152 0.2625 2.6516 1.7815 2.0411 0.6915 0.0067 2.3536 7.5065 3.8017 10.7271 1.1445 0.3729 4.0663 0.3898 0.0463 2.5802 24.7949 0.5177 5.4652 40.9821 0.8067 0.0115 80.4375 6.3203 2.4307 0.0175 2.0825 0.1537 3.0684 0.9398 2.8213 10.2230 16.0579 0.3289 1.4653 22.7613 15.3726 112.6383 35.2190 341.0440 1.9073 3.7043 2.0468 4.9210 33.7582 77.3983 55.9832 15.4147 0.7323 23.1458 6.9756 29.9353 38.8113 1.1419 33.1499 8.1401 95.4610 0.7802 100.7720 66.7690 31.1889 6.6688 0.0020 35.4741 0.3718 17.8766 7.8252 2.7106 10.0544 2.7131 0.0200 3.9398
temp: 298.150 k
press: 1.00000 atm
elementType: 8 8 7 7 6 6 6 6 6 6 6 6 6 6 6 6 6 1 1 1 1 1 1 1 1 1 1 1 1
symmnumber: 1
zpe: 580737.5 jmol-1
zpe.correction: 0.221191 hartree
zpe.thermalcorrener: 0.234965 hartree
zpe.thermalcorrenthalpy: 0.235909 hartree
zpe.thermalcorrgfe: 0.179368 hartree
zpe.sumelectzpe: -761.264327 hartree
zpe.sumelectthermal: -761.250553 hartree
zpe.sumelectthermalent: -761.249609 hartree
zpe.sumelectthermalfe: -761.306150 hartree
dipole: -4.1681 0.0000 0.0000
dipole: 4.1681
quadrupole: -139.1389 -86.6646 -99.9249
quadrupole: 0.0001 -0.0002 0.2446
quadrupole: -30.5628 21.9115 8.6513 0.0001 -0.0002 0.2446
hfenergy: -761.4855178 hartree
pointgroup: C01 [X(C13H12N2O2)]
dipole: -1.6398504 0.0004932 -0.0003724 debye
polarizability: 285.1602391|-0.0365654|170.9996243|0.049687|9.3228552|82.3251285 unknown
InChI: InChI=1S/C13H12N2O2/c1-9-7-12(8-10(2)14-9)11-3-5-13(6-4-11)15(16)17/h3-8H,1-2H3
charge 0 multiplicity 1
29 atoms
O  5.155856 -1.054764 -0.438271
O  5.156287 1.051299 0.440648
N  -4.096997 0.001086 -0.000966
N  4.549549 -0.001542 0.00103
C  -1.243916 0.000198 -0.000269
C  0.245588 -0.000258 0.00008
C  -1.981988 -1.194431 0.205031
C  -1.981145 1.195287 -0.205924
C  -3.397881 -1.161473 0.198792
C  -3.397061 1.163211 -0.200376
C  0.974624 -1.126748 -0.476753
C  0.975086 1.125792 0.477241
C  3.067922 -0.001104 0.000706
C  2.380377 -1.136756 -0.480705
C  2.380843 1.134958 0.481816
C  -4.215618 -2.417844 0.419506
C  -4.213907 2.420091 -0.421494
H  -1.469482 -2.142236 0.400572
H  -1.467952 2.142774 -0.401208
H  0.433766 -1.990514 -0.876255
H  0.434569 1.989881 0.876504
H  2.95053 -1.99193 -0.85251
H  2.951343 1.989791 0.853873
H  -5.287023 -2.170941 0.370901
H  -3.992483 -3.183591 -0.346625
H  -4.000005 -2.868794 1.406116
H  -3.990714 3.185677 0.344782
H  -3.997481 2.870937 -1.407973
H  -5.28549 2.173846 -0.373471
