program: Gaussian 09
title: 000257962
version: EM64L-G09RevD.01
frameworkgroup: C1[X(C11H14O2)]
method: RPBEPBE
basis: SDD
operation: Freq
keyword: #pfreq=noraman
keyword: PBEPBE/SDD
title: #p freq=noraman PBEPBE/SDD
converged: YES YES NO NO
title: Mulliken charges:
elementType: O O C C C C C C C C C C C H H H H H H H H H H H H H H
charge: -0.280040 -0.271057 0.360686 -0.432041 -0.384083 -0.318813 0.517592 0.320116 -0.325626 -0.363213 -0.794812 -0.725398 -0.538079 0.222317 0.205392 0.245837 0.249219 0.240525 0.247082 0.216837 0.254521 0.223053 0.224774 0.225356 0.218635 0.218161 0.243060
chargesum: 0.00000
title: Mulliken charges with hydrogens summed into heavy atoms:
elementType: O O C C C C C C C C C C C
charge: -0.280040 -0.271057 0.360686 -0.004332 -0.138246 -0.069594 0.517592 0.320116 -0.085101 -0.116131 -0.100402 -0.275268 0.141776
polarizability: 1.97153545e+02 -7.73021367e+00 1.14320904e+02 -9.38749886e+00 -8.15812671e-01 7.74183640e+01
1716.lowfreq: -4.6747 -0.0005 0.0002 0.0007 6.5515 10.4198 33.3827 45.9841 83.4982
frequency: 33.3050 45.7688 83.4902 91.5362 124.6560 160.2978 173.5709 200.2483 220.4265 246.3678 348.3715 361.6615 392.2181 415.8477 423.6020 454.1381 505.9483 514.4912 552.9826 631.2795 684.4264 710.8099 728.5625 799.3091 811.5148 818.5473 845.1708 923.1095 938.5852 953.2508 955.0595 970.4077 986.5090 988.9951 998.5004 1035.7534 1064.0540 1112.9060 1113.3501 1158.3920 1169.5816 1195.6733 1208.1533 1239.4148 1297.7427 1307.9986 1351.6968 1378.1842 1390.9916 1422.5375 1433.2065 1438.4957 1454.5938 1467.1215 1469.3353 1474.9149 1480.1032 1498.0201 1584.4081 1629.1587 1678.2250 2930.6334 2953.4577 2973.9990 3010.6835 3038.2223 3056.2830 3091.8937 3096.4117 3121.0906 3149.5224 3151.2854 3169.2270 3173.1150 3195.3385
redmass: 3.9432 3.1774 3.1947 3.8636 2.7732 3.3328 1.2015 4.1484 3.3629 1.1754 3.5705 5.3917 2.7879 3.0642 2.9340 2.8400 3.3726 2.3437 4.3451 6.7801 1.4191 3.6720 2.6906 1.2475 5.5771 1.6936 3.2270 1.3643 1.3389 2.5263 1.4639 1.5027 1.9235 6.0001 2.9249 1.5027 1.6487 1.3123 1.2603 1.3330 1.1932 2.5504 1.1462 5.1915 1.5249 1.9640 1.6523 3.9940 1.2562 3.4995 1.1720 1.2022 1.0542 1.0505 1.1183 1.0759 1.0798 2.1809 7.2200 6.7040 5.1165 1.0596 1.0333 1.0385 1.1014 1.1036 1.0939 1.0637 1.0998 1.0988 1.0871 1.0874 1.0961 1.0967 1.1140
irintensity: 1.1382 0.2580 4.2608 1.2179 0.4822 7.5724 1.4456 2.5176 2.1601 0.7726 0.2812 0.0745 1.4663 1.1768 4.2141 6.8107 4.9617 20.1044 3.8960 0.1393 12.5710 0.0140 25.4340 0.0345 0.5546 95.7781 2.6929 0.1037 1.7015 118.6997 42.8020 0.6629 53.8247 21.3011 58.6945 12.7131 3.1289 17.5753 0.3787 0.7197 3.4388 462.7779 29.5006 0.9973 0.8739 2.1560 8.3900 36.3092 30.1623 2.8775 17.2355 15.5416 16.0158 13.0928 101.7942 51.1053 13.0219 229.0282 0.2154 0.1204 18.5759 39.1944 74.0021 22.8555 36.5960 54.7708 19.3896 10.9120 26.6026 28.0360 16.5123 7.1590 17.4329 0.3520 23.9122
temp: 298.150 k
press: 1.00000 atm
elementType: 8 8 6 6 6 6 6 6 6 6 6 6 6 1 1 1 1 1 1 1 1 1 1 1 1 1 1
symmnumber: 1
zpe: 581732.9 jmol-1
zpe.correction: 0.221570 hartree
zpe.thermalcorrener: 0.235033 hartree
zpe.thermalcorrenthalpy: 0.235977 hartree
zpe.thermalcorrgfe: 0.180738 hartree
zpe.sumelectzpe: -576.988795 hartree
zpe.sumelectthermal: -576.975333 hartree
zpe.sumelectthermalent: -576.974388 hartree
zpe.sumelectthermalfe: -577.029627 hartree
dipole: -0.2070 0.4872 0.3250
dipole: 0.6212
quadrupole: -64.4911 -73.2585 -81.0201
quadrupole: -8.8085 3.1671 -0.1213
quadrupole: 8.4321 -0.3353 -8.0969 -8.8085 3.1671 -0.1213
hfenergy: -577.2103657 hartree
pointgroup: C01 [X(C11H14O2)]
dipole: -0.0732849 -0.1748444 -0.1542237 debye
polarizability: 196.2019132|8.3766755|114.2507932|13.1539332|4.5723166|78.4401066 unknown
InChI: InChI=1S/C11H14O2/c1-9(2)8-13-11-6-4-10(12-3)5-7-11/h4-7H,1,8H2,2-3H3
charge 0 multiplicity 1
27 atoms
O  1.517874 -0.440175 0.290872
O  -4.040305 0.467503 -0.110335
C  0.141653 -0.15715 0.183657
C  2.453247 0.698082 0.165281
C  -0.719991 -1.27463 0.270846
C  -0.406152 1.139996 0.004903
C  3.865521 0.149897 0.194698
C  -2.664283 0.184249 -0.003572
C  -2.117588 -1.112215 0.17844
C  -1.803196 1.30261 -0.088281
C  4.182902 -0.930615 -0.8181
C  4.777227 0.648933 1.069256
C  -4.964265 -0.662561 -0.021421
H  2.286739 1.417393 0.991955
H  2.257855 1.211668 -0.802386
H  -0.27918 -2.26637 0.412017
H  0.23455 2.02421 -0.058502
H  -2.760685 -1.994415 0.249072
H  -2.244783 2.294384 -0.225777
H  4.004125 -0.571523 -1.850996
H  3.517992 -1.799853 -0.665459
H  5.231194 -1.264581 -0.741079
H  4.512287 1.417107 1.805632
H  5.816221 0.300623 1.074353
H  -4.884343 -1.175736 0.957468
H  -4.79093 -1.393695 -0.835967
H  -5.967685 -0.224034 -0.127076
