program: Gaussian 09
title: 000257954
version: EM64L-G09RevD.01
frameworkgroup: C1[X(C10H13NO)]
method: RPBEPBE
basis: SDD
operation: Freq
keyword: #p
keyword: freq=noraman
keyword: PBEPBE/SDD
title: #p freq=noraman PBEPBE/SDD
converged: YES YES NO NO
title: Mulliken charges:
elementType: O N C C C C C C C C C C H H H H H H H H H H H H H
charge: -0.277838 -0.634622 -0.233290 0.564984 -0.692452 -0.690152 -0.530193 -0.464139 0.283949 -0.226798 -0.368936 0.139255 0.204793 0.224048 0.220497 0.213213 0.225085 0.212198 0.222303 0.278877 0.237830 0.226857 0.212508 0.317466 0.334556
chargesum: 0.00000
title: Mulliken charges with hydrogens summed into heavy atoms:
elementType: O N C C C C C C C C C C
charge: -0.277838 0.017400 -0.028497 0.564984 -0.034693 -0.030566 -0.251315 -0.226309 0.283949 0.000059 -0.156428 0.139255
polarizability: 1.52626153e+02 1.53217807e+00 1.26961497e+02 1.69740402e+00 1.07630927e+00 6.92701587e+01
1716.lowfreq: -7.2482 0.0003 0.0003 0.0004 6.1364 14.2222 38.8013 52.3507 111.4400
frequency: 38.5842 51.2315 111.3736 131.4308 164.6984 223.9183 240.6599 261.1091 304.4451 312.3585 364.6431 413.0354 458.1978 473.9933 485.0014 538.4594 570.2221 585.4938 614.4404 687.0482 708.3000 735.7086 813.1181 831.9935 905.1147 911.3744 923.5541 956.0500 958.7106 983.2081 989.8398 1044.6490 1074.7875 1094.8441 1111.1394 1114.1291 1160.9566 1186.8276 1222.9784 1282.9293 1306.3361 1332.9923 1355.1890 1382.7887 1389.4552 1402.3072 1437.8237 1468.3179 1470.4007 1473.0759 1481.2457 1489.8105 1570.1726 1596.9471 1611.9617 1634.7463 2976.4297 2976.8027 2979.6095 3070.9073 3076.5523 3077.4691 3082.4811 3117.1059 3125.6938 3143.7216 3153.5828 3529.6693 3683.4356
redmass: 4.6162 2.9138 3.2989 4.2481 3.8906 1.0496 1.5778 1.6544 2.7755 3.1558 5.2032 3.1745 2.8832 3.1657 1.2956 1.9877 2.8380 3.7773 1.8288 4.8448 1.9406 3.6015 1.8292 3.4012 2.5598 1.3833 1.2102 1.5709 1.3663 1.3793 5.6695 1.8485 1.5289 1.9595 1.8787 2.4989 1.8577 1.0844 2.0457 1.4890 1.3259 1.6978 3.2202 1.1938 5.0319 1.2582 2.7661 1.0441 1.0515 2.1965 1.0483 1.1283 3.1244 3.1245 4.0731 2.5240 1.0372 1.0670 1.0492 1.1001 1.0994 1.1006 1.0996 1.0858 1.0914 1.0909 1.0988 1.0447 1.1040
irintensity: 12.9807 0.6764 0.2083 4.1095 0.7932 0.0637 3.0355 2.6097 0.8621 0.8541 0.8705 2.7527 6.3067 25.2580 109.3254 49.1848 5.2683 20.8555 82.2159 4.3379 23.7980 61.2492 19.3195 4.9996 9.0838 0.1794 4.2005 8.9780 2.1427 0.1947 0.5886 0.6819 12.2186 12.3609 3.1618 1.1442 0.1053 1.3926 13.2993 41.1815 0.5144 63.1468 165.7997 16.3628 9.4792 6.6558 21.2427 1.4433 4.2490 0.3406 18.7265 21.2587 103.7849 62.0246 57.3554 176.5344 32.6336 26.1308 25.2115 0.8296 90.9854 25.9651 41.0650 0.0353 29.1611 5.7575 25.4789 36.3466 28.5486
temp: 298.150 k
press: 1.00000 atm
elementType: 8 7 6 6 6 6 6 6 6 6 6 6 1 1 1 1 1 1 1 1 1 1 1 1 1
symmnumber: 1
zpe: 546918.2 jmol-1
zpe.correction: 0.208310 hartree
zpe.thermalcorrener: 0.220314 hartree
zpe.thermalcorrenthalpy: 0.221258 hartree
zpe.thermalcorrgfe: 0.169892 hartree
zpe.sumelectzpe: -517.972017 hartree
zpe.sumelectthermal: -517.960013 hartree
zpe.sumelectthermalent: -517.959069 hartree
zpe.sumelectthermalfe: -518.010434 hartree
dipole: 0.3086 3.5380 1.0378
dipole: 3.6999
quadrupole: -54.2036 -74.3554 -75.7030
quadrupole: 7.4123 3.5868 -1.3442
quadrupole: 13.8837 -6.2681 -7.6157 7.4123 3.5868 -1.3442
hfenergy: -518.1803267 hartree
pointgroup: C01 [X(C10H13N1O1)]
dipole: -0.083172 -1.3822168 0.4488843 debye
dipolederiv: -0.7095674 0.1247892 0.0287592 0.0253624 -0.9965515 0.164685 0.0663847 0.1141897 -0.4073969 -1.2122975 -0.2423467 0.1247073 -0.1914825 -0.3856504 -0.0769612 0.1152912 -0.0872062 -0.6793342 0.1889008 -0.0365437 0.0033325 -0.1094853 0.0691896 -0.0031419 0.0057117 0.0006227 0.124118 0.3321675 0.2321285 0.0112209 0.1768399 -0.0210489 0.0024829 0.01109 0.0048026 -0.1026088 -0.0143455 -0.0496356 -0.0174816 -0.0265081 0.0272873 -0.0419107 0.0534315 -0.0276758 -0.0243731 -0.0120762 -0.049998 0.0176379 -0.0282278 0.0264745 0.0396051 -0.0539557 0.0214467 -0.0282304 -0.1647655 -0.1425897 0.0032845 0.0972689 0.0066952 0.0064863 -0.0284272 -0.0071005 -0.1120656 -0.0241197 -0.100205 0.0053165 -0.1074535 -0.0265894 -0.0036746 0.0065151 -0.0023685 -0.1470495 -0.2899336 0.1728528 0.0047079 0.2647012 -0.1246837 0.0255436 -0.0224845 0.0283188 0.01013 -0.1336246 0.0399071 0.0020191 0.0202795 0.1406556 0.0071679 0.0058732 0.0059644 -0.1283525 -0.0097116 0.0414712 0.0234965 -0.078863 -0.0458504 0.0048719 0.0700004 -0.0084061 -0.1749589 1.7299658 -0.0625941 -0.2174249 -0.0720789 1.1577694 -0.2422556 -0.2351911 -0.1789125 0.3138748 -0.0547085 0.0727062 -0.0030006 0.1317789 -0.111416 0.0050789 -0.0036759 0.0031497 0.0184948 0.1067773 -0.0167986 0.043708 0.0043201 0.0139108 0.1222535 0.0302151 0.0771148 -0.1180978 0.0015117 0.1380027 0.0089189 0.1100385 -0.0336745 -0.0281854 -0.0195125 0.0255922 0.069141 -0.1826167 -0.1209939 -0.0348959 -0.1272096 0.0337474 -0.0355404 -0.0183221 -0.0238485 0.074353 0.1109937 -0.0124864 -0.0288411 0.0111172 0.0108907 -0.1232674 -0.0172095 -0.0798724 -0.1158633 -0.1860199 -0.1221561 0.021108 -0.1291098 0.0347278 0.0285359 0.00441 0.0175486 0.0755846 0.0029743 0.1375435 -0.0137522 0.1072997 -0.0309449 0.0350063 0.0147452 -0.0159309 0.0704201 0.1552817 -0.0220257 -0.0002373 -0.0649211 -0.0103114 -0.0064968 0.0179311 -0.0014698 0.1332423 -0.0651361 0.1109119 -0.0074239 0.0854325 0.0401936 0.0012971 -0.0059934 0.0032718 0.1402025 0.0685586 -0.0236956 -0.0047052 -0.0195484 -0.1369244 -0.004671 -0.0073119 -0.0059453 0.1540301 -0.1190961 -0.0881697 -0.0138732 -0.0730591 0.0702253 -0.0072284 -0.0231429 0.001174 0.1499854 0.2778064 0.0030284 0.0159334 -0.01196 0.1203173 0.0770595 0.0101354 0.0835694 0.3438639 0.2030809 0.0168973 0.0274854 0.0054682 0.1715611 0.0532596 0.0234923 0.0519713 0.3608906 unknown
polarizability: 152.5346329|2.3264158|126.9643923|-0.6498281|-2.8295349|69.3587832 unknown
InChI: InChI=1S/C10H13NO/c1-7(2)8-4-3-5-9(6-8)10(11)12/h3-7H,11H2,1-2H3
charge 0 multiplicity 1
25 atoms
O  -2.229202 2.040795 -0.412851
N  -3.616453 0.286832 0.18209
C  2.655797 0.251789 0.030487
C  1.259683 -0.374802 -0.009865
C  2.86132 1.108191 1.308247
C  2.940169 1.087215 -1.246384
C  0.096175 0.430889 -0.048652
C  1.098093 -1.783883 -0.01452
C  -1.198185 -0.14042 -0.08408
C  -0.187815 -2.369239 -0.065361
C  -1.337773 -1.553454 -0.100514
C  -2.368523 0.81167 -0.123905
H  3.392168 -0.577032 0.060731
H  2.697542 0.509924 2.222748
H  2.159404 1.962144 1.332548
H  3.889039 1.515401 1.339069
H  2.830734 0.474202 -2.159098
H  3.968529 1.493216 -1.221518
H  2.241669 1.940379 -1.327083
H  0.160299 1.524841 -0.059322
H  1.98676 -2.426672 0.013274
H  -0.290695 -3.459892 -0.086118
H  -2.323832 -2.027003 -0.17832
H  -3.750038 -0.664281 0.516877
H  -4.415668 0.91839 0.149024
