program: Gaussian 09
title: 000257953
version: EM64L-G09RevD.01
frameworkgroup: C1[X(C10H11NO3)]
method: RPBEPBE
basis: SDD
operation: Freq
keyword: #p
keyword: freq=noraman
keyword: PBEPBE/SDD
title: #p freq=noraman PBEPBE/SDD
converged: NO YES NO NO
title: Mulliken charges:
elementType: O O O N C C C C C C C C C C H H H H H H H H H H H
charge: -0.264719 -0.219398 -0.220424 0.021149 0.365160 -0.343746 -0.311610 0.376781 -0.328008 -0.333781 -0.360934 -0.229195 -0.134026 -0.725127 0.263558 0.258978 0.230126 0.230212 0.288634 0.285218 0.257266 0.212842 0.226589 0.226600 0.227855
chargesum: 0.00000
title: Mulliken charges with hydrogens summed into heavy atoms:
elementType: O O O N C C C C C C C C C C
charge: -0.264719 -0.219398 -0.220424 0.021149 0.365160 -0.080188 -0.052631 0.376781 0.132330 -0.045147 -0.075716 0.028070 0.078817 -0.044084
polarizability: 2.37778966e+02 3.99299581e+00 1.23653827e+02 1.23156141e-01 7.10934705e-03 5.90187848e+01
1716.lowfreq: -103.3961 -7.7295 -6.6151 -1.5668 0.0003 0.0007 0.0008 30.6001 63.4589
frequency: -103.3816 30.5278 63.4575 68.8302 97.8961 130.1939 173.9418 180.5224 224.0762 249.5526 275.8826 301.2329 405.8088 416.2440 419.5065 495.6437 506.3117 537.7260 622.0452 632.2980 665.1090 726.9627 732.5967 757.6916 813.6396 817.6407 850.8697 927.0313 961.8029 971.8074 972.6777 986.6803 993.7550 1007.2078 1047.4245 1094.8225 1096.4864 1110.7670 1128.5907 1169.0256 1191.6709 1225.5793 1236.3795 1263.7638 1291.4017 1294.0764 1350.8393 1356.8776 1395.7527 1403.8755 1435.7533 1460.1795 1463.7077 1470.9920 1483.1157 1588.3743 1612.7861 1697.2038 2945.8213 2971.1279 3002.6596 3046.3858 3067.7640 3092.6500 3129.0339 3167.2119 3168.5322 3186.1994 3190.8357
redmass: 1.8028 5.2865 4.6064 5.7960 3.4751 4.4407 4.8099 1.2048 6.8800 2.2307 5.1090 6.3862 5.8557 4.7052 3.0195 3.0273 6.0613 3.7333 7.1776 7.9200 4.5093 1.4174 4.8557 8.8900 7.2012 1.2819 1.6473 1.5682 7.0802 1.0867 1.3033 1.3345 2.8857 1.6360 1.5435 3.2964 3.2068 1.2611 2.2433 1.4218 1.0575 5.1984 3.0361 1.4145 1.2962 1.2423 4.1443 1.6698 1.2324 7.4248 4.3670 1.0470 1.2363 1.0711 1.9621 7.7474 6.5732 6.3595 1.0549 1.0366 1.1066 1.0971 1.0916 1.0989 1.0905 1.0882 1.0893 1.0961 1.0971
irintensity: 2.2522 0.4628 0.5804 0.2725 0.1424 10.2961 2.5360 1.3784 1.2015 6.5034 0.9775 0.2285 0.4019 0.3861 0.1151 10.2984 1.8148 0.9473 2.7994 23.8744 22.7211 0.6069 5.8542 2.7146 15.2812 6.3752 72.7163 36.3279 96.9221 69.8039 0.7155 0.1184 0.6688 2.3218 0.4051 10.0621 10.1801 24.2344 13.8772 271.4661 1.0143 499.2071 178.8647 29.1310 0.5785 1.5021 72.8590 41.3967 8.2223 40.5814 15.8454 15.5878 56.3188 30.6214 28.7567 39.8413 220.3783 4.1873 19.1222 36.8167 30.0657 25.0302 7.1668 41.5066 10.5249 5.6884 1.3732 2.8601 5.0424
temp: 298.150 k
press: 1.00000 atm
elementType: 8 8 8 7 6 6 6 6 6 6 6 6 6 6 1 1 1 1 1 1 1 1 1 1 1
symmnumber: 1
zpe: 501563.3 jmol-1
zpe.correction: 0.191035 hartree
zpe.thermalcorrener: 0.203884 hartree
zpe.thermalcorrenthalpy: 0.204828 hartree
zpe.thermalcorrgfe: 0.150387 hartree
zpe.sumelectzpe: -666.942550 hartree
zpe.sumelectthermal: -666.929701 hartree
zpe.sumelectthermalent: -666.928757 hartree
zpe.sumelectthermalfe: -666.983198 hartree
dipole: -7.5231 -0.7752 -0.0118
dipole: 7.5629
quadrupole: -101.6217 -76.6181 -84.3240
quadrupole: 6.6513 -0.1176 0.0108
quadrupole: -14.1004 10.9032 3.1973 6.6513 -0.1176 0.0108
hfenergy: -667.1335853 hartree
pointgroup: C01 [X(C10H11N1O3)]
dipole: 2.9611138 0.2905677 -0.0292623 debye
dipolederiv: -2.2639884 -0.1050279 0.0378008 0.0321233 -0.2843338 -0.0025908 0.0696527 0.0010404 -0.2780948 -0.9164255 -0.2015771 -0.0203244 -0.3501049 -0.607109 -0.0657613 -0.0510592 -0.0704696 -0.2531453 -0.7617327 0.1927349 0.0574918 0.3996747 -0.7201927 -0.1137728 0.1015132 -0.1072363 -0.2663064 2.2138472 -0.0627509 -0.0791756 -0.1492306 1.0538765 0.1858215 -0.0991077 0.1831187 0.2344786 1.9619484 -0.0077319 -0.057491 -0.4159888 0.1702387 0.019373 -0.1468326 0.0072805 0.1404997 -0.676322 -0.0481633 0.005318 -0.3574303 0.0472199 0.0570273 -0.0602252 0.0470538 -0.1575316 -0.5656677 0.0719798 0.0260614 0.585617 -0.0936528 0.0035352 0.1354095 0.0192771 -0.1979222 -1.0967673 0.0479013 0.0459996 0.1043849 -0.1023245 -0.0298923 0.059465 -0.0280234 0.0162833 1.0316156 0.1361964 0.0111587 0.6645836 0.3151684 -0.0471283 0.1235365 -0.0312931 0.4295804 0.3924136 -0.0230185 -0.0207617 -0.3273423 0.0608298 0.0437068 -0.084606 0.0340313 -0.0875941 0.5159619 0.0006433 -0.0191625 0.2020816 0.0168931 0.0150514 0.022951 0.0215587 -0.0831169 0.0052458 -0.0100297 -0.0080837 -0.2287325 0.0370763 0.0714088 -0.0545224 0.0657741 -0.242879 0.2015843 -0.008651 -0.0113267 -0.0397273 0.1399501 0.0855825 -0.0169057 0.0851893 -0.2265934 -0.1853119 0.0474836 0.016797 -0.0397395 0.0319544 -0.0130838 -0.0032763 -0.0153431 0.0933062 0.070158 0.0585922 0.0156067 0.0555084 0.0016776 -0.0366342 0.014538 -0.0366136 0.1596565 0.0151166 -0.0823865 -0.0121229 -0.110717 0.0136519 -0.0287368 -0.0183778 -0.0294045 0.1612666 -0.119435 0.0368354 -0.0384264 -0.0893536 -0.0603399 0.0870242 -0.0593474 0.0890339 -0.0156514 -0.1122527 0.0127866 0.0517644 -0.1097885 0.0111718 -0.0674616 0.0191149 -0.0770076 -0.0911927 0.0840296 -0.0689987 -0.0116692 -0.019775 0.0745332 -0.019537 -0.0009838 -0.0180238 0.1670496 0.1059118 0.0479724 0.0120297 0.0137958 0.0510236 -0.025013 0.0047222 -0.026186 0.16275 0.0749814 0.0090108 0.004416 0.0462481 -0.0470182 -0.0522936 0.0114769 -0.0512141 0.1728885 0.0479902 0.0524991 0.0139536 0.0530236 -0.1342615 -0.0666582 0.0142325 -0.0667522 0.1473826 -0.0428622 -0.0401704 0.0875248 -0.0138186 0.0508321 0.0982536 0.1537983 0.0817582 -0.0187692 -0.0533973 -0.0023884 -0.0963198 0.0489342 0.1075029 -0.0434366 -0.1458956 -0.0250533 -0.0648538 0.0733583 -0.0537416 -0.0110585 0.0457736 -0.1343678 -0.0547842 0.0107289 -0.0524952 0.0985088 unknown
polarizability: 237.6900764|3.9743268|120.8517488|-4.4831582|12.998421|61.909752 unknown
InChI: InChI=1S/C10H11NO3/c1-2-3-8-14-10-6-4-9(5-7-10)11(12)13/h2-7H,8H2,1H3
charge 0 multiplicity 1
25 atoms
O  1.581279 -0.640677 -0.218516
O  -4.76741 -0.80772 -0.04486
O  -4.444526 1.406888 0.409972
N  -4.001772 0.218857 0.145463
C  0.227137 -0.345495 -0.113581
C  -0.649121 -1.446951 -0.316773
C  -0.295289 0.945393 0.174549
C  -2.544325 0.023467 0.055302
C  2.557268 0.453522 -0.011455
C  -2.035495 -1.267188 -0.232998
C  -1.68776 1.126779 0.258481
C  3.930652 -0.159285 -0.176774
C  5.092927 0.528173 -0.050772
C  6.469654 -0.072716 -0.212772
H  -0.214249 -2.42592 -0.536454
H  0.36565 1.801479 0.33228
H  2.367239 1.25225 -0.758326
H  2.412731 0.877749 1.003884
H  -2.731157 -2.096248 -0.383939
H  -2.12227 2.105477 0.47793
H  3.933761 -1.230976 -0.413282
H  5.058823 1.60387 0.187323
H  7.030746 0.429652 -1.024325
H  7.06811 0.049043 0.710708
H  6.414598 -1.149623 -0.447866
