program: Gaussian 09
title: 000257950
version: EM64L-G09RevD.01
frameworkgroup: C1[X(C10H10O2)]
method: RPBEPBE
basis: SDD
operation: Freq
keyword: #pfreq=noraman
keyword: PBEPBE/SDD
title: #p freq=noraman PBEPBE/SDD
converged: NO YES NO NO
title: Mulliken charges:
elementType: O O C C C C C C C C C C H H H H H H H H H H
charge: -0.261142 -0.270330 0.341804 0.321824 -0.372571 -0.320459 -0.323413 -0.361922 -0.363771 -0.537713 0.194033 -0.459096 0.250475 0.243711 0.242238 0.248584 0.233896 0.233896 0.219292 0.243952 0.219288 0.277424
chargesum: 0.00000
title: Mulliken charges with hydrogens summed into heavy atoms:
elementType: O O C C C C C C C C C C
charge: -0.261142 -0.270330 0.341804 0.321824 -0.122096 -0.076748 -0.081175 -0.113338 0.104021 0.144820 0.194033 -0.181673
polarizability: 1.92349118e+02 -4.64156650e+00 9.94947847e+01 -4.07390642e-04 2.96870162e-04 5.45007995e+01
1716.lowfreq: -12.8771 -12.6564 -0.0007 0.0004 0.0006 5.8861 33.1031 80.2946 89.0451
frequency: 33.0916 80.2662 89.0277 111.1081 154.4279 195.5238 227.1898 234.3580 326.1970 349.7987 363.1315 417.5461 421.9453 482.5115 513.4010 550.6285 629.8112 637.9763 683.1728 711.7700 716.4377 795.6947 811.4862 816.3591 922.4703 936.0870 938.7586 987.9378 993.0130 994.9705 996.8026 1110.9936 1113.0702 1156.4547 1169.7068 1193.7174 1201.5846 1238.3971 1299.9996 1348.1075 1377.6515 1421.8883 1435.3405 1464.9742 1465.8440 1472.4895 1495.7762 1583.5287 1629.1091 2158.2302 2941.1339 2953.1349 2991.9146 3038.7469 3121.4833 3149.3354 3151.7051 3169.5635 3173.4140 3424.0448
redmass: 5.1679 3.2910 4.5263 2.8027 4.3792 4.5683 3.7872 1.1806 3.1482 6.1464 5.8042 3.0351 4.9480 5.0874 2.3288 5.5896 6.9376 1.2289 1.2649 3.6005 6.2662 1.2557 6.8201 1.6872 1.3762 7.3275 1.3424 6.7655 3.9041 1.5949 2.8802 1.2601 1.3112 1.3416 1.1965 2.9274 1.0531 5.0253 1.2902 1.4849 4.2944 3.4046 1.2087 1.0505 1.1254 1.0760 2.2240 7.2008 6.7540 6.0029 1.0542 1.0333 1.1048 1.1038 1.0988 1.0873 1.0875 1.0963 1.0968 1.1613
irintensity: 1.7447 5.3446 1.2265 2.0618 8.4751 2.7796 1.1684 0.9809 6.9158 1.7450 1.0677 0.1715 7.1755 1.6409 20.5871 4.6699 0.0637 76.2997 57.6681 0.0166 37.0887 1.7623 1.4379 97.7800 0.1020 48.4679 1.3309 31.8402 106.2760 0.6689 35.3480 0.1815 17.3460 0.9404 1.6172 489.0523 0.2265 6.2299 0.7215 31.9817 50.6187 2.8947 18.5663 13.1076 46.5133 64.6454 233.4215 0.2509 0.0933 1.3008 35.7684 70.3425 24.8983 53.6808 27.1328 20.5936 5.1352 14.9858 0.4050 67.4085
temp: 298.150 k
press: 1.00000 atm
elementType: 8 8 6 6 6 6 6 6 6 6 6 6 1 1 1 1 1 1 1 1 1 1
symmnumber: 1
zpe: 446053.0 jmol-1
zpe.correction: 0.169893 hartree
zpe.thermalcorrener: 0.181736 hartree
zpe.thermalcorrenthalpy: 0.182680 hartree
zpe.thermalcorrgfe: 0.131462 hartree
zpe.sumelectzpe: -536.532343 hartree
zpe.sumelectthermal: -536.520500 hartree
zpe.sumelectthermalent: -536.519556 hartree
zpe.sumelectthermalfe: -536.570774 hartree
dipole: -0.6509 0.0566 0.0028
dipole: 0.6534
quadrupole: -53.7885 -65.7263 -74.1269
quadrupole: 9.6192 -0.0029 -0.0017
quadrupole: 10.7587 -1.1790 -9.5797 9.6192 -0.0029 -0.0017
hfenergy: -536.7022356 hartree
pointgroup: C01 [X(C10H10O2)]
dipole: -0.2564433 -0.0177129 -0.0007006 debye
dipolederiv: -2.0055136 0.0708698 0.0051287 0.0718741 -0.2743346 -0.0001592 0.0049687 -0.000223 -0.2763911 -1.8253388 0.1688611 0.0053432 0.0158841 -0.3200547 -0.0002975 0.0037959 -0.0004566 -0.3001279 1.5988124 0.0704154 -0.0028327 0.3530196 -0.1074708 -0.0031534 0.0009299 -0.0023612 0.0724209 1.5056919 0.046312 -0.0026721 0.2861019 -0.124679 -0.002882 -0.0002169 -0.0024559 0.0737229 -0.2651296 -0.1525897 -0.0015094 0.1844018 0.0987847 0.0027091 0.0025858 0.0034457 -0.1594204 -0.159675 0.1335893 0.001536 -0.276787 0.0380237 0.0035535 -0.0034683 0.0025952 -0.2011157 -0.1636536 0.1274298 0.0014501 -0.2560267 0.0467397 0.0035372 -0.0030452 0.0027348 -0.2003212 -0.2426194 -0.1401965 -0.0014985 0.2379452 0.1006186 0.0026361 0.0029496 0.0034832 -0.1649814 1.2236534 -0.087052 -0.0032347 -0.5927452 0.4341637 0.0017406 -0.0095927 0.000472 0.4120776 0.6869034 -0.1516293 -0.0025481 -0.5100916 0.3831213 0.0016893 -0.0066958 0.0008716 0.3358857 -0.0652013 0.0637572 0.0007814 -0.0039467 -0.1037315 -0.0004723 -0.0000162 -0.0006855 -0.0614715 -0.4968683 -0.0188488 0.0002426 -0.0365878 -0.2615593 0.0007026 0.000125 0.0006711 -0.3117642 0.0709429 -0.0622127 -0.0005384 -0.0690193 -0.0271221 -0.0022048 -0.0006239 -0.0021937 0.1692623 -0.000774 0.1071482 0.0016607 0.1311638 -0.0081712 -0.0024367 0.0019689 -0.0023895 0.1684775 -0.0024525 0.0998863 0.0016007 0.1087383 -0.0092103 -0.0023598 0.0017071 -0.0023615 0.1658591 0.0599187 -0.0631894 -0.0005114 -0.0701311 -0.0340969 -0.0022774 -0.0006101 -0.00231 0.1686887 -0.0494173 -0.0535055 0.0434281 0.1188067 -0.0246491 0.0850571 0.013146 0.1078842 -0.042639 -0.0496724 -0.0531475 -0.044772 0.1185398 -0.0199126 -0.0850759 -0.0101987 -0.1069807 -0.0469816 0.0459181 -0.0239869 -0.0580626 0.1486372 -0.0419918 -0.1125421 0.016766 -0.1150566 -0.098945 -0.15278 -0.0457503 -0.0000737 -0.0950488 0.0623632 -0.000584 -0.0006785 -0.0006758 0.1227247 0.0461064 -0.0250097 0.0571135 0.1492832 -0.047329 0.1131217 -0.0137125 0.1163044 -0.0936462 0.2411486 -0.0111506 -0.0000315 -0.0140116 0.240498 -0.0003021 -0.000084 -0.0003123 0.2686857 unknown
polarizability: 192.4835822|2.9976972|99.3533204|-0.3023279|0.5262244|54.5078 unknown
InChI: InChI=1S/C10H10O2/c1-3-8-12-10-6-4-9(11-2)5-7-10/h1,4-7H,8H2,2H3
charge 0 multiplicity 1
22 atoms
O  1.851573 0.537004 0.067749
O  -3.697773 -0.510246 0.067816
C  0.476036 0.212085 0.067006
C  -2.325973 -0.194556 0.068334
C  -0.402952 1.31855 0.082248
C  -0.049785 -1.10597 0.052367
C  -1.798672 1.123114 0.083033
C  -1.445901 -1.300881 0.053108
C  2.789834 -0.604041 0.050939
C  -4.643005 0.606529 0.082259
C  4.161127 -0.088143 0.052976
C  5.330163 0.298808 0.054097
H  0.023709 2.326189 0.093399
H  0.601833 -1.984588 0.040314
H  -2.45638 1.997121 0.095096
H  -1.871649 -2.308889 0.041935
H  2.621205 -1.241947 0.944248
H  2.61552 -1.219949 -0.856601
H  -4.525426 1.224844 0.994274
H  -5.639346 0.140252 0.078242
H  -4.528092 1.24617 -0.81528
H  6.346756 0.649242 0.055242
