program: Gaussian 09
title: 000257974
version: EM64L-G09RevD.01
frameworkgroup: C1[X(C14H8N2O8)]
method: RPBEPBE
basis: SDD
operation: Freq
keyword: #p
keyword: freq=noraman
keyword: PBEPBE/SDD
title: #p freq=noraman PBEPBE/SDD
converged: YES YES NO NO
title: Mulliken charges:
elementType: O O O O O O O O N N C C C C C C C C C C C C C C H H H H H H H H
charge: -0.435820 -0.435821 -0.234432 -0.234431 -0.193583 -0.193583 -0.193659 -0.193658 0.022326 0.022326 0.290993 0.290997 0.122835 0.122834 -0.499456 -0.499450 0.408529 0.408530 -0.291583 -0.291583 -0.375736 -0.375737 0.093987 0.093982 0.304075 0.304073 0.292069 0.292069 0.294184 0.294184 0.395269 0.395269
chargesum: 0.00000
title: Mulliken charges with hydrogens summed into heavy atoms:
elementType: O O O O O O O O N N C C C C C C C C C C C C C C
charge: -0.040551 -0.040551 -0.234432 -0.234431 -0.193583 -0.193583 -0.193659 -0.193658 0.022326 0.022326 0.290993 0.290997 0.122835 0.122834 -0.195381 -0.195376 0.408529 0.408530 0.000486 0.000486 -0.081551 -0.081552 0.093987 0.093982
polarizability: 2.73303435e+02 1.31308315e-03 1.89287198e+02 -1.01732667e+01 -3.95159973e-04 1.62194460e+02
1716.lowfreq: -10.1643 -6.5936 -0.0009 -0.0004 -0.0002 3.6334 12.8336 35.2737 40.5152
frequency: 12.7131 35.2618 40.4892 46.1499 51.1590 62.2512 67.2472 82.9406 86.3593 122.5786 166.1973 186.2523 191.4371 248.0222 256.8735 262.2767 287.5075 289.4040 307.5380 314.7703 430.8820 432.4830 461.5137 468.0529 479.6764 502.7304 510.1546 524.0655 576.9953 577.9784 590.9968 594.8391 625.9424 633.9086 635.7373 680.9614 683.8910 698.3121 705.0295 713.3385 732.3092 740.2955 781.6845 785.5667 805.6179 876.0088 876.0142 888.3349 934.8930 943.8137 1002.3169 1007.4283 1007.6096 1010.3482 1040.2255 1081.9905 1094.5018 1126.0278 1136.3683 1156.1650 1156.5276 1210.6586 1212.1424 1246.8184 1264.0557 1270.1907 1318.1513 1321.5733 1366.6299 1373.8414 1378.1855 1380.5885 1408.6000 1425.7490 1464.4557 1491.6540 1582.0635 1583.9128 1605.3246 1608.4490 1640.3719 1643.5207 3176.7867 3177.3173 3180.8937 3180.9296 3197.6522 3197.6604 3532.6539 3532.9534
redmass: 9.7759 11.3625 11.5965 12.9131 13.3857 11.3621 11.5978 5.9144 5.7894 10.3117 9.6397 6.3144 6.2865 9.2049 7.0053 7.3090 12.4822 12.0398 5.8814 5.8781 3.3647 3.2995 7.6839 6.9781 8.8079 8.4778 6.8843 6.7378 3.8704 3.8936 1.3936 1.4002 7.6664 5.2346 4.8467 4.3124 4.2356 4.7856 5.9708 6.5153 7.1213 10.5170 4.6418 4.4683 9.1831 1.5211 1.4995 6.3262 1.4808 1.4830 5.1771 1.3828 1.3928 5.0991 3.1697 2.0588 3.0512 1.7150 1.3490 1.8043 1.7574 10.3006 8.9662 2.2191 1.4127 1.6798 2.5540 2.5688 5.1949 6.8357 10.7168 8.9720 6.6351 4.5144 2.6568 3.7395 8.0275 8.3251 7.3950 7.7289 8.9260 8.9349 1.0925 1.0924 1.0892 1.0892 1.0971 1.0971 1.0643 1.0644
irintensity: 1.1111 0.8726 0.1682 0.1543 0.1063 0.5788 0.2140 0.8669 1.5633 1.3348 8.0272 1.5570 1.7061 2.9916 2.7122 0.1966 2.2333 0.3172 0.2588 1.6448 2.6526 5.3910 24.6404 30.1781 15.0217 3.0398 5.2612 6.3192 54.9893 44.4838 55.9839 38.9434 1.9397 23.7828 36.1568 49.4872 69.7060 5.6435 13.6989 8.4209 35.6522 37.7295 7.8817 4.3217 20.1947 27.7497 26.0061 9.9517 24.6844 22.9768 275.8480 6.8093 10.2338 232.4146 97.8464 7.4374 28.5908 66.8509 35.6411 102.2415 99.5267 335.7938 197.8364 6.6598 3.1063 8.0075 89.1559 88.8112 76.9840 15.5057 4.4913 106.8811 82.7549 3.6385 53.4661 10.3057 8.1137 5.1807 30.7695 2.0783 16.8287 486.5073 3.5707 4.0996 0.6854 3.0169 0.4899 1.0485 60.2955 73.6963
temp: 298.150 k
press: 1.00000 atm
elementType: 8 8 8 8 8 8 8 8 7 7 6 6 6 6 6 6 6 6 6 6 6 6 6 6 1 1 1 1 1 1 1 1
symmnumber: 1
zpe: 543121.1 jmol-1
zpe.correction: 0.206864 hartree
zpe.thermalcorrener: 0.227540 hartree
zpe.thermalcorrenthalpy: 0.228484 hartree
zpe.thermalcorrgfe: 0.153927 hartree
zpe.sumelectzpe: -1247.757154 hartree
zpe.sumelectthermal: -1247.736479 hartree
zpe.sumelectthermalent: -1247.735534 hartree
zpe.sumelectthermalfe: -1247.810091 hartree
dipole: 0.0002 6.0842 0.0002
dipole: 6.0842
quadrupole: -161.2356 -140.0199 -125.3691
quadrupole: -0.0001 -18.9524 0.0003
quadrupole: -19.0274 2.1883 16.8391 -0.0001 -18.9524 0.0003
hfenergy: -1247.9640182 hartree
pointgroup: C01 [X(C14H8N2O8)]
dipole: -0.0001203 2.3937004 0.0004014 debye
polarizability: 271.5584663|0.0040386|189.2871973|-17.1561114|0.0050538|163.9394304 unknown
InChI: InChI=1S/C14H8N2O8/c17-13(18)9-3-1-7(15(21)22)5-11(9)12-6-8(16(23)24)2-4-10(12)14(19)20/h1-6,17,19H
charge 0 multiplicity 1
32 atoms
O  -1.003825 2.694317 2.894155
O  1.003579 2.695253 -2.893391
O  0.841016 2.238159 1.568216
O  -0.841059 2.238877 -1.567243
O  -5.033688 -2.013047 -0.136597
O  5.03384 -2.012778 0.13578
O  -3.307292 -2.722261 -1.448166
O  3.307501 -2.722593 1.447099
N  -3.80986 -1.957594 -0.539134
N  3.810011 -1.957554 0.538349
C  -0.717314 0.099634 0.228668
C  0.71733 0.099769 -0.228658
C  -1.227443 0.957155 1.251468
C  1.227394 0.957697 -1.251149
C  -1.579495 -0.86345 -0.339925
C  1.579576 -0.863477 0.339563
C  -2.918786 -0.94203 0.08832
C  2.918867 -0.941814 -0.088723
C  -2.579776 0.848472 1.666577
C  2.579731 0.849248 -1.666314
C  -3.442385 -0.097662 1.087211
C  3.442406 -0.097043 -1.087305
C  -0.348286 1.989137 1.876591
C  0.348179 1.989869 -1.875877
H  -1.227622 -1.545339 -1.118486
H  1.227755 -1.545678 1.117875
H  -2.941244 1.520351 2.447984
H  2.941144 1.521429 -2.447485
H  -4.487987 -0.19341 1.389138
H  4.488011 -0.192612 -1.389277
H  -0.380945 3.371507 3.272062
H  0.380669 3.372568 -3.271027
